program: Gaussian 16
title: displacement calc 0.5
version: ES64L-G16RevB.01
frameworkgroup: C1[X(C24H25N2O3Pd)]
method: RwB97XD
basis: Gen
operation: Freq
keyword: #P
keyword: Geom=AllCheck
keyword: Guess=TCheck
keyword: SCRF=Check
keyword: GenChk
keyword: RwB97XD/ChkBas
keyword: Freq
converged: YES YES NO YES
title: Mulliken charges:
elementType: C C C C C C C H H H H C C N C H C C H H H N O Pd O O C H H C H C C C H C C H H H C H C C H H H C H H H C H H H
charge: 0.293347 0.253272 -0.151307 -0.155099 -0.152264 -0.177102 0.562967 0.190907 0.174012 0.176656 0.199760 0.240083 -0.137669 -0.548925 -0.118816 0.217239 0.080410 -0.139264 0.201825 0.194441 0.199066 -0.906557 -0.451747 0.378612 0.226872 -0.421637 -0.351880 0.157484 0.178012 0.060745 0.200598 0.039386 -0.161149 -0.150159 0.156223 -0.161200 -0.145050 0.155990 0.155614 0.153678 -0.126349 0.172793 0.192725 -0.391401 0.166166 0.147572 0.152667 -0.411395 0.176140 0.153408 0.166099 -0.403019 0.164731 0.169116 0.153373
chargesum: 1.00000
title: Mulliken charges with hydrogens summed into heavy atoms:
elementType: C C C C C C C C C N C C C N O Pd O O C C C C C C C C C C C C
charge: 0.293347 0.253272 0.039599 0.018913 0.024393 0.022659 0.562967 0.240083 0.079570 -0.548925 0.083009 0.274851 0.059803 -0.906557 -0.451747 0.378612 0.226872 -0.421637 -0.016384 0.261343 0.039386 -0.004926 0.005831 -0.005587 0.008628 0.046444 0.192725 0.075003 0.084252 0.084200
polarizability: 4.39983137e+02 6.01063976e+01 4.65067546e+02 -8.27749181e+00 7.48302395e+01 3.45507255e+02
1716.lowfreq: -11.1646 -7.1815 -0.0005 -0.0003 0.0005 7.3259 16.9518 17.6122 30.1457
frequency: 16.8576 17.4793 30.0273 48.1995 58.5921 59.2220 69.0050 90.8981 98.7361 119.3646 132.8273 140.2643 169.4233 182.4828 192.7148 204.0346 207.5200 227.3996 257.2480 264.0299 274.1688 287.4140 292.8844 315.0348 323.9258 332.2164 357.9436 367.5618 380.1426 385.8879 418.1755 425.9573 433.0691 443.5229 452.7425 509.3474 515.1375 516.9267 539.1850 559.4596 576.6806 583.7724 590.6040 600.3193 635.3754 650.1075 660.3802 705.7137 724.4042 724.8813 728.6598 761.3990 768.7313 771.4107 775.9553 781.6314 820.3152 823.0441 836.3523 851.1622 874.4903 882.0381 889.8649 902.5396 918.5251 938.5937 945.6542 949.0928 951.7147 968.8140 985.7049 986.5507 1005.3820 1012.9819 1017.8609 1023.1543 1025.6777 1027.5762 1044.3896 1046.3270 1049.1304 1051.0801 1058.3139 1066.7535 1068.9892 1095.0129 1120.0487 1135.0875 1146.9611 1164.6121 1180.3968 1185.0192 1185.6108 1191.5736 1199.0826 1204.6484 1219.7018 1230.1490 1236.9514 1279.2800 1290.4445 1306.0977 1308.3114 1331.7452 1336.5183 1337.6678 1354.6802 1371.9969 1372.8551 1389.8729 1415.9597 1420.9529 1433.7628 1460.3953 1476.0800 1485.5313 1488.0945 1491.2723 1493.9596 1497.7424 1500.2011 1504.0782 1510.5079 1519.8199 1539.7106 1549.1025 1552.6122 1631.8796 1666.4668 1670.6684 1686.1067 1692.9929 1702.0864 1706.2873 3058.2615 3070.5348 3074.9681 3081.4563 3104.3564 3154.4436 3160.9714 3164.4388 3172.9369 3174.7780 3183.4541 3187.6183 3206.2608 3215.0959 3224.4192 3234.8143 3235.4574 3242.5513 3245.2016 3246.4067 3253.5407 3259.9184 3259.9890 3269.0112 3269.3694
redmass: 4.8098 6.0627 4.2766 4.9370 5.0374 3.0790 4.8251 4.6510 5.1696 5.4380 4.8560 7.5853 5.3742 5.3087 5.2074 2.3695 5.6493 1.4630 3.8781 2.8395 1.6727 1.9977 6.8874 6.3542 1.3514 3.3689 2.6020 5.4898 3.4234 2.4972 2.9567 3.8222 3.3566 3.2143 2.7441 3.7028 3.4370 3.5822 3.5760 3.6389 8.1394 5.7291 3.8883 5.9139 6.3911 7.1013 7.0814 4.0102 2.8888 2.3947 6.2001 2.6970 3.1000 2.2647 2.2281 1.3452 2.0393 2.0186 2.7004 5.7290 1.2880 4.5773 1.4225 4.0804 6.8971 1.3269 1.5397 1.6053 1.4283 2.4255 1.2163 1.4080 1.3674 7.8263 1.4207 5.5905 1.2976 1.3146 3.4750 2.6064 2.0420 1.3545 1.4245 1.4996 2.1473 2.2618 1.5264 1.6086 1.5075 1.6408 1.3995 1.1661 1.1667 1.4639 2.0113 2.5273 1.1533 1.6238 2.8849 1.7778 2.5320 2.6329 2.7232 2.2306 2.4995 1.8196 2.7172 1.9323 1.6140 6.4186 1.3525 1.3549 1.2293 3.8141 1.0485 1.1513 1.6416 1.1944 1.2143 1.0920 2.1576 1.0780 2.1682 1.0721 2.9491 3.0807 2.2733 9.0183 6.3425 6.0296 7.3123 5.8779 7.3158 7.8655 1.0828 1.0373 1.0364 1.0374 1.0610 1.1029 1.1025 1.1033 1.1036 1.1032 1.1034 1.1039 1.0884 1.0880 1.0931 1.0889 1.0963 1.0966 1.0901 1.0931 1.0934 1.0978 1.0967 1.0958 1.0980
irintensity: 0.5074 0.9787 0.1092 0.2808 2.5979 0.1476 0.8275 0.4120 0.2273 1.5179 0.2438 0.9827 0.5758 4.3078 1.0626 0.1470 3.1246 0.3263 5.0203 6.9407 4.7729 1.2577 0.3039 2.6036 0.8040 0.5732 2.8669 4.0658 1.4182 2.9488 0.2085 3.7281 4.9100 11.2878 1.4606 14.3451 1.0225 5.1659 11.7724 0.1404 0.3452 17.4936 0.7191 5.6523 0.0776 1.2709 17.8287 35.5426 51.6167 52.3238 3.3910 31.8845 6.5723 6.1012 8.5236 175.5898 9.1981 12.8951 20.4997 37.0421 6.8608 86.9160 1.5109 3.2972 12.2352 0.9722 1.0558 0.8461 8.0558 10.0285 1.2555 7.7626 0.0316 4.8504 1.7296 1.3648 0.3022 0.0643 41.8401 32.0020 9.1126 0.1857 0.5112 1.3434 11.1220 8.5471 13.2385 30.6044 9.1425 22.0814 19.8230 0.8827 2.2211 8.1912 206.8940 30.8222 1.1863 16.1772 19.6244 50.1024 18.8018 15.4118 12.5826 14.6120 19.9366 13.8277 41.6107 2.9243 32.8001 4.3134 37.3911 27.3613 22.5627 210.1660 0.2755 2.2129 32.2278 10.4723 11.5039 6.6653 27.7090 4.3796 31.6773 14.3163 27.2676 30.8701 14.6642 166.5274 10.8500 1.2752 12.1322 4.5791 6.3025 6.2670 2.8644 14.9102 21.0735 8.8554 33.6324 16.7200 25.7303 25.1449 23.4230 20.2102 19.9988 16.1700 6.2536 0.5033 21.1021 2.9038 21.2856 9.5470 3.3050 5.8006 0.7438 0.7628 0.2719 2.8706 5.9286
temp: 298.150 k
press: 1.00000 atm
elementType: 6 6 6 6 6 6 6 1 1 1 1 6 6 7 6 1 6 6 1 1 1 7 8 46 8 8 6 1 1 6 1 6 6 6 1 6 6 1 1 1 6 1 6 6 1 1 1 6 1 1 1 6 1 1 1
symmnumber: 1
zpe: 1183106.6 jmol-1
zpe.correction: 0.450622 hartree
zpe.thermalcorrener: 0.477185 hartree
zpe.thermalcorrenthalpy: 0.478129 hartree
zpe.thermalcorrgfe: 0.392479 hartree
zpe.sumelectzpe: -1391.727107 hartree
zpe.sumelectthermal: -1391.700543 hartree
zpe.sumelectthermalent: -1391.699599 hartree
zpe.sumelectthermalfe: -1391.785249 hartree
dipole: -3.5151 5.5700 -0.9154
dipole: 6.6497
quadrupole: -135.2775 -131.1247 -164.0229
quadrupole: 11.1790 -8.1235 16.0158
quadrupole: 8.1976 12.3503 -20.5479 11.1790 -8.1235 16.0158
hfenergy: -1392.1777283 hartree
pointgroup: C01 [X(C24H25N2O3Pd1)]
dipole: -1.346127 2.2116679 0.3753901 debye
polarizability: 442.0344984|64.0674941|410.6651939|8.8549868|92.4993939|397.8582461 unknown
InChI: InChI=1S/C12H8N2O.C12H17O2.Pd/c1-2-7-11-9(5-1)14-12(15-11)10-6-3-4-8-13-10;1-10(13-14-12(2,3)4)11-8-6-5-7-9-11;/h1-8H;5-10H,1H2,2-4H3;/q-2;;+2
charge 1 multiplicity 1
55 atoms
C  -3.99898023 0.02248988 -0.05054763
C  -2.89694012 -0.5255324 -0.70346478
C  -3.07087967 -1.52805893 -1.6559858
C  -4.37456504 -1.94773964 -1.8863232
C  -5.46829764 -1.39018411 -1.20142403
C  -5.30545301 -0.37849829 -0.2615763
C  -2.22352627 1.02789948 0.626865
H  -2.23417573 -1.94984721 -2.19864125
H  -4.55605431 -2.72590548 -2.61992504
H  -6.4675635 -1.75289292 -1.41679647
H  -6.13940478 0.06998633 0.26509486
C  -1.36559297 1.97394303 1.33097336
C  -1.82354327 2.83880096 2.31190484
N  -0.07537348 1.90512016 0.94045016
C  -0.89227003 3.66752991 2.93423335
H  -2.87201622 2.85625285 2.58628767
C  0.80877366 2.69045974 1.55496731
C  0.44065326 3.58712223 2.5567397
H  -1.2081944 4.35777522 3.70847139
H  1.8399712 2.59849514 1.2353046
H  1.19677134 4.2061928 3.02455232
N  -1.77002461 0.14503712 -0.22158853
O  -3.54580159 1.01163687 0.79221207
Pd 0.25739896 0.18959095 -0.47527948
O  2.36183038 0.19662465 -0.92909494
O  2.8210182 -1.1584586 -1.21691692
C  0.44913303 -1.58463618 -1.3714073
H  -0.34332955 -2.2730681 -1.07281804
H  0.46016678 -1.47787465 -2.46067303
C  1.79392979 -2.06238381 -0.8375727
H  2.10299316 -2.97491598 -1.36841195
C  1.7809753 -2.32650646 0.66341992
C  0.91270994 -3.29412366 1.17762539
C  0.85732582 -3.53857173 2.54645443
H  0.27925206 -3.8658257 0.50410657
C  2.54555077 -1.86126941 2.91233813
C  1.67038818 -2.81744008 3.42004852
H  0.18170249 -4.29668812 2.9309155
H  3.19052918 -1.30215797 3.58370856
H  1.62701552 -3.00691786 4.48811694
C  2.60449237 -1.61883434 1.54059427
H  3.29084095 -0.87423422 1.15167445
C  2.87634693 1.06614197 -2.0161094
C  4.39048522 0.9049298 -2.0629286
H  4.68090185 -0.08260273 -2.42518256
H  4.80161844 1.65422895 -2.74516351
H  4.82520086 1.064614 -1.0720327
C  2.49565269 2.46834115 -1.56535104
H  1.41299188 2.57477088 -1.44615186
H  2.99619177 2.72920737 -0.62958537
H  2.82044773 3.17580793 -2.3329871
C  2.20975838 0.69757357 -3.33255352
H  2.41861029 -0.33956248 -3.60361844
H  1.12654271 0.84330824 -3.27514684
H  2.60209832 1.34386884 -4.12271197
