program: Gaussian 16
title: Title Card Required
version: ES64L-G16RevA.03
frameworkgroup: C1[X(C20H17N2O3Pd)]
method: RwB97XD
basis: Gen
operation: Freq
keyword: #P
keyword: Geom=AllCheck
keyword: Guess=TCheck
keyword: SCRF=Check
keyword: GenChk
keyword: RwB97XD/ChkBas
keyword: Freq
converged: YES YES YES YES
title: Mulliken charges:
elementType: C C C C C C C H H H H C C N C H C C H H H N O Pd O O C H H C H H C C C H C C H H H C H
charge: 0.288435 0.244912 -0.145363 -0.153702 -0.151216 -0.172177 0.577226 0.184230 0.177011 0.180113 0.203433 0.278046 -0.132670 -0.583099 -0.112479 0.226814 0.096965 -0.134891 0.210630 0.245033 0.210399 -0.634528 -0.459274 0.667880 -0.716277 -0.555487 -0.531168 0.243409 0.205392 0.466368 0.239337 0.384902 0.012809 -0.144135 -0.151843 0.165079 -0.150738 -0.122924 0.164854 0.166864 0.168204 -0.140436 0.184066
chargesum: 1.00000
title: Mulliken charges with hydrogens summed into heavy atoms:
elementType: C C C C C C C C C N C C C N O Pd O O C C C C C C C C
charge: 0.288435 0.244912 0.038867 0.023309 0.028897 0.031256 0.577226 0.278046 0.094144 -0.583099 0.098151 0.341998 0.075508 -0.634528 -0.459274 0.667880 -0.331375 -0.555487 0.156969 0.466368 0.012809 0.020944 0.013011 0.016126 0.045280 0.043630
polarizability: 4.35131858e+02 -2.61700033e+01 4.68760092e+02 -1.62357409e+01 -1.79012990e+01 1.85630437e+02
1716.lowfreq: -5.8234 -1.4368 0.0002 0.0005 0.0007 14.1852 21.3749 26.5061 42.6470
frequency: 20.2154 26.0212 42.4433 53.5028 63.4561 83.8593 98.1925 114.0859 122.0902 125.1289 141.6629 182.5243 184.9919 200.6376 208.7883 256.8681 269.3159 284.5573 308.8876 331.9764 335.6592 364.1939 379.9198 410.8912 415.3010 432.4568 440.8735 458.6671 479.4570 503.7649 515.2037 570.5489 576.7289 587.9715 595.4990 617.9648 633.1272 652.1449 655.3388 672.3854 707.8778 720.2680 726.9342 759.7045 767.4947 771.0620 778.9525 791.5821 813.9506 849.3124 876.6895 888.8954 918.2352 939.2160 972.6368 981.8747 983.6262 1015.4536 1015.9084 1023.4985 1025.5645 1031.6245 1039.4335 1047.6423 1051.2164 1053.2411 1060.3594 1068.7559 1078.1153 1102.3625 1112.6489 1130.6355 1133.6518 1153.2814 1182.8914 1183.8105 1190.2713 1203.9036 1214.8568 1234.1385 1288.9637 1309.3613 1319.8714 1336.4444 1351.7367 1359.4420 1373.4954 1387.6906 1389.3213 1465.0524 1467.2651 1488.4835 1501.5038 1508.6775 1538.5602 1550.1173 1550.6004 1571.8791 1632.9977 1662.5796 1666.7947 1685.8423 1687.9736 1704.6136 1708.1331 1772.4559 2838.9422 3032.3436 3181.4713 3222.7486 3231.6821 3236.6148 3238.9892 3243.7773 3246.7402 3248.5697 3250.4768 3251.2009 3263.6345 3263.9909 3268.0428 3287.8651 3788.2165
redmass: 5.3845 6.1693 4.2322 8.1295 5.6427 5.5585 8.2667 6.0825 4.7355 6.1115 4.6655 4.0584 5.7260 5.9842 5.7658 4.8401 7.9398 7.5125 7.3231 6.3330 6.2045 1.7903 5.5472 4.0792 2.8585 3.3743 3.2380 2.2921 1.5905 1.8791 3.6765 10.4099 8.2490 3.8915 7.9655 3.7932 6.2968 2.7749 5.1253 6.8730 1.8428 4.9676 6.4826 4.3163 4.2825 1.9533 1.3857 1.7060 2.0816 5.8054 1.2506 1.3854 7.0251 1.3310 1.3730 1.8600 1.4108 8.6356 1.3842 5.2720 1.3073 1.3673 1.3546 2.3199 1.3708 2.0691 5.5907 1.9515 1.7983 1.3221 1.7380 1.4846 1.5768 1.5895 1.1829 1.1480 1.1004 2.8979 1.1346 3.2400 2.4130 2.6620 1.4730 2.0781 1.6639 4.3569 3.5185 1.9083 4.0801 1.0750 3.3861 2.4943 2.3657 2.5569 3.1415 3.7517 2.3003 1.0607 8.7734 6.9501 5.8531 5.7904 7.3781 8.0016 7.6362 11.0244 1.0624 1.0857 1.0881 1.0871 1.0899 1.0893 1.0934 1.0937 1.0952 1.0935 1.0980 1.0917 1.0952 1.0978 1.1002 1.0920 1.0671
irintensity: 0.6030 1.7764 0.9316 1.0962 2.1280 4.0427 11.6999 0.4797 0.1288 0.0914 2.7402 16.7580 3.1232 0.2781 2.3579 7.9331 12.5258 12.2804 1.8414 3.3576 2.0801 0.4040 5.7211 5.0728 0.5426 2.7052 6.5084 15.9806 69.5558 100.8560 1.0463 130.6717 4.7000 0.5057 12.9627 39.7312 2.4153 14.4274 8.7797 6.5672 51.2823 16.1300 0.3733 4.1413 3.5890 1.7388 168.2476 40.7516 20.9618 48.4594 0.0711 0.0609 9.8907 0.8288 9.6472 56.7873 7.1138 1.1135 0.5603 7.7629 0.0480 1.2125 2.0728 19.5923 0.1253 25.9674 15.1093 8.5856 5.9751 106.1147 9.2579 14.9822 21.5348 6.6899 0.6413 5.1237 2.0453 36.1531 30.7821 21.8113 296.3849 10.3798 6.7843 15.6725 1.9792 98.5201 15.1806 139.0804 59.4818 32.4510 230.6016 33.4664 42.2272 32.8466 41.3190 49.6062 2.4663 53.1896 127.2061 1.3319 31.7001 82.6008 13.1122 14.7947 0.8905 377.5133 55.3998 6.0450 2.1665 0.1634 5.6290 3.0812 12.0728 30.1828 14.5895 5.8356 7.1359 0.7887 4.3875 0.9937 0.0704 2.4460 492.8012
temp: 298.150 k
press: 1.00000 atm
elementType: 6 6 6 6 6 6 6 1 1 1 1 6 6 7 6 1 6 6 1 1 1 7 8 46 8 8 6 1 1 6 1 1 6 6 6 1 6 6 1 1 1 6 1
symmnumber: 1
zpe: 881612.2 jmol-1
zpe.correction: 0.335788 hartree
zpe.thermalcorrener: 0.358032 hartree
zpe.thermalcorrenthalpy: 0.358976 hartree
zpe.thermalcorrgfe: 0.282343 hartree
zpe.sumelectzpe: -1234.690670 hartree
zpe.sumelectthermal: -1234.668426 hartree
zpe.sumelectthermalent: -1234.667482 hartree
zpe.sumelectthermalfe: -1234.744116 hartree
dipole: -8.0887 -5.5354 2.5302
dipole: 10.1227
quadrupole: -69.6825 -118.8057 -161.9649
quadrupole: -24.3334 -2.6972 7.0727
quadrupole: 47.1351 -1.9880 -45.1472 -24.3334 -2.6972 7.0727
hfenergy: -1235.0264583 hartree
pointgroup: C01 [X(C20H17N2O3Pd1)]
dipole: -3.6788215 -1.1414981 1.0120083 debye
polarizability: 425.6472025|-14.910768|468.9336114|-7.3044415|-56.7644481|194.9415736 unknown
InChI: InChI=1S/C12H8N2O.C8H8O.H2O.Pd/c1-2-7-11-9(5-1)14-12(15-11)10-6-3-4-8-13-10;1-7(9)8-5-3-2-4-6-8;;/h1-8H;2-6H,1H3;1H2;/q-2;;;+3/p-1
charge 1 multiplicity 1
43 atoms
C  -3.49797822 -1.66773685 0.25854714
C  -2.12768635 -1.60151575 0.01137723
C  -1.37064695 -2.76638395 -0.08970399
C  -2.05379707 -3.96491749 0.06565572
C  -3.43754476 -4.00615051 0.31325892
C  -4.20023893 -2.84822487 0.41710133
C  -2.92858676 0.39371705 0.08434215
H  -0.30536256 -2.73758637 -0.28085172
H  -1.50599575 -4.89812634 -0.00692652
H  -3.92492121 -4.96853253 0.42526159
H  -5.26699387 -2.86454249 0.60533477
C  -2.98818928 1.84558586 0.02497402
C  -4.12103322 2.61335462 0.21419765
N  -1.77932908 2.39449427 -0.24426326
C  -3.99353685 3.99959026 0.12124321
H  -5.07206173 2.14050657 0.42856054
C  -1.65281385 3.71715002 -0.33466825
C  -2.75196619 4.55397238 -0.15450487
H  -4.8608256 4.63412609 0.26438345
H  -0.65371017 4.07918222 -0.55428182
H  -2.61856166 5.62603524 -0.23288816
N  -1.80548034 -0.24823094 -0.09193514
O  -3.98715883 -0.37977944 0.30288739
Pd -0.24721342 1.07201347 -0.47454993
O  0.93164606 2.57902253 -0.79309547
O  3.35882682 0.99965087 -1.11752136
C  1.65106796 -0.51854089 -0.46483564
H  1.22203696 -0.3367971 0.53519694
H  1.11861213 -0.06848192 -1.33946139
C  3.07606012 -0.00584394 -0.47844815
H  1.58434859 -1.5937035 -0.63764736
H  1.80785194 2.25108043 -1.04632708
C  4.09700117 -0.73686807 0.31486843
C  3.76202236 -1.81984433 1.13830036
C  4.74782707 -2.4629043 1.87875191
H  2.73651346 -2.16609895 1.21445661
C  6.41143258 -0.95694457 0.98029578
C  6.07091475 -2.03397621 1.79886302
H  4.48315579 -3.29856851 2.5182394
H  7.44230622 -0.62364526 0.92013937
H  6.83876479 -2.53938911 2.37634829
C  5.4294906 -0.30891784 0.24360457
H  5.68133628 0.53190211 -0.39391269
