program: Gaussian 09
title: 000046183
version: EM64L-G09RevD.01
frameworkgroup: C1[X(C23H30N2O5)]
method: RPBEPBE
basis: SDD
operation: Freq
keyword: #p
keyword: freq=noraman
keyword: PBEPBE/SDD
title: #p freq=noraman PBEPBE/SDD
converged: NO YES NO NO
title: Mulliken charges:
elementType: O O O O O N N C C C C C C C C C C C C C C C C C C C C C C C H H H H H H H H H H H H H H H H H H H H H H H H H H H H H H
charge: -0.434652 -0.291828 -0.241425 -0.238987 -0.223596 -0.081187 -0.180897 -0.354340 -0.368760 -0.388751 -0.420341 -0.407010 -0.140045 0.502279 -0.299584 -0.531291 -0.416609 0.214350 -0.339223 0.191256 0.393082 -0.513112 -0.352645 0.329511 -0.538633 -0.216245 -0.538063 -0.377175 0.121501 -0.787349 0.189556 0.201209 0.226223 0.197987 0.204282 0.213667 0.212823 0.218457 0.220596 0.186610 0.258854 0.220375 0.227121 0.238801 0.237233 0.327633 0.237401 0.256342 0.254399 0.246244 0.217239 0.215143 0.229479 0.215439 0.216409 0.243327 0.279048 0.236051 0.240462 0.261360
chargesum: 0.00000
title: Mulliken charges with hydrogens summed into heavy atoms:
elementType: O O O O O N N C C C C C C C C C C C C C C C C C C C C C C C
charge: -0.107019 -0.291828 -0.241425 -0.238987 -0.223596 -0.081187 -0.180897 0.036425 0.055449 0.029197 0.010938 0.000197 0.118809 0.502279 0.147912 -0.292491 -0.179376 0.214350 -0.101822 0.191256 0.393082 -0.256770 -0.098246 0.329511 0.139992 0.013234 0.137112 -0.098127 0.121501 -0.049477
polarizability: 3.12866354e+02 2.94281862e+01 3.46829098e+02 -7.20930594e+00 -1.78624495e+01 2.16376274e+02
1716.lowfreq: -1.5473 -0.0009 -0.0003 0.0003 5.2128 6.5956 9.7375 12.5153 19.6907
frequency: 6.8770 12.4286 19.6010 28.9772 50.6377 52.0542 58.8516 69.8393 82.0701 85.8910 99.1338 108.4346 117.9313 145.1017 148.6304 160.1229 165.3069 175.9093 185.2850 194.4173 211.9499 223.8912 235.4042 245.8790 260.0468 265.4764 283.5126 302.3975 310.5661 319.6993 338.9175 353.2003 362.1455 378.7124 386.4833 400.7023 417.8166 422.8304 446.2614 454.7753 466.3147 475.7362 491.5114 497.5860 523.2252 552.4763 579.8896 590.1793 590.7564 618.9338 629.4829 629.9733 683.0957 692.9800 701.0529 724.7534 733.3002 776.7942 788.9561 800.4482 831.5654 835.5646 851.4493 853.2251 887.0113 889.5164 892.3198 901.3731 913.4509 944.8785 945.8643 960.3554 980.0557 986.2512 987.4883 989.8480 999.7153 1000.8823 1017.1740 1026.2613 1054.3242 1061.5343 1072.7423 1077.1086 1094.8151 1102.3192 1111.6457 1112.0141 1121.4954 1133.9738 1139.9339 1146.9014 1156.0358 1158.0946 1171.9444 1176.6492 1190.0712 1198.1161 1202.7946 1212.4512 1225.0951 1228.5311 1254.2273 1263.4508 1273.8069 1276.9913 1286.9130 1297.1669 1302.0109 1320.4714 1338.7756 1345.1189 1352.6338 1369.4623 1370.6310 1372.0551 1374.8134 1383.2152 1387.1651 1393.9491 1400.5908 1423.1741 1431.1327 1435.7204 1447.2650 1447.9540 1451.4439 1454.2728 1458.7792 1461.1850 1461.8607 1465.4587 1466.9588 1467.9191 1470.9764 1471.7882 1473.5652 1474.1570 1510.6861 1572.5168 1583.7595 1606.1337 1614.1259 1619.8767 2860.3196 2867.6826 2879.4681 2894.4196 2907.0323 2948.9079 2950.4165 2965.1055 2970.7566 2984.9859 3023.1589 3032.6485 3035.1751 3036.8618 3048.1969 3064.9725 3069.5046 3073.6857 3078.2745 3120.3071 3121.2783 3125.2621 3137.8936 3148.1183 3159.8364 3163.6378 3164.2877 3170.7746 3173.8984 3538.5439
redmass: 6.6261 4.2702 4.0930 5.1630 5.0639 4.9563 3.2483 4.8254 3.5359 5.2307 3.5852 3.5042 4.2453 1.0314 3.8664 4.3235 3.7274 2.9165 4.1802 4.1410 2.3641 2.8477 4.3103 1.7514 1.8937 1.4377 2.3836 1.3268 2.4504 2.5786 4.0501 3.5389 3.8637 3.6518 4.0783 2.3870 3.4765 3.2271 4.0773 3.0929 2.8514 4.5447 3.6984 3.4491 3.5967 5.5238 4.9536 4.8848 4.4647 2.8175 3.6073 3.0588 3.1863 2.0459 6.3935 2.4867 5.2396 2.5258 1.9693 1.4650 1.9012 4.6285 1.6725 4.5302 1.8675 1.5504 1.3926 1.8396 1.5746 2.2692 2.5346 3.6117 5.5305 5.4054 3.5939 1.3386 3.9781 3.2494 2.6145 1.8487 1.7973 1.9919 1.8955 2.1097 1.5129 2.2306 1.2623 1.2621 2.7525 2.5925 2.4568 1.4423 2.6490 1.4514 1.9924 1.1680 1.7448 2.3019 1.1100 1.1438 1.9109 1.9774 1.6721 1.4486 3.1325 1.4865 1.3434 1.5018 1.4174 1.3342 1.3420 1.3385 2.0368 1.2656 1.5679 1.2551 1.5759 2.3575 1.7117 2.3723 1.9661 2.0059 2.4916 1.1832 1.1666 1.5213 1.0904 1.2105 1.1001 1.1125 1.0547 1.0506 1.0509 1.1291 1.1105 1.9577 1.1827 1.0885 2.6543 6.1166 7.5240 7.7825 6.5622 6.5490 1.0696 1.0698 1.0671 1.0692 1.0705 1.0334 1.0334 1.0557 1.0900 1.0375 1.0900 1.1034 1.1036 1.1075 1.0906 1.0885 1.0969 1.0867 1.0891 1.0985 1.0986 1.0992 1.0873 1.0867 1.0911 1.0895 1.0915 1.0946 1.0979 1.0660
irintensity: 0.1768 0.0331 0.1206 0.2813 1.2735 2.6671 1.5190 4.2715 10.6217 4.4785 7.4522 1.4351 0.3989 0.5913 1.2486 0.5517 0.2655 11.6166 1.2813 0.5633 2.3104 7.0769 0.2572 1.3900 2.4963 0.5970 2.5000 84.8996 10.0816 35.6372 18.7826 17.0137 4.4989 6.0197 19.3867 8.8921 3.7809 2.6043 6.4277 2.9528 1.2284 1.6933 2.9309 2.6852 0.1821 4.6357 13.3350 13.6496 2.6627 2.5440 9.3015 0.1017 15.5820 29.8376 9.2596 1.3972 24.5863 4.2173 52.5949 51.6734 20.1220 7.3859 1.2178 9.2227 9.3240 32.0950 1.1697 2.6824 0.9173 64.5582 32.8858 15.4730 34.6468 3.2434 163.5268 2.8519 10.0253 117.3269 17.2047 0.9417 6.8635 12.3271 2.9714 1.8685 12.5768 14.0877 0.0118 0.3761 5.0696 85.5015 33.3262 5.2439 40.1259 23.5290 50.4770 14.6937 88.9255 105.0573 4.5319 2.8477 321.9413 5.4424 45.8268 31.5805 324.8025 22.0758 30.0009 35.5447 4.3327 16.1174 6.4191 1.3370 6.7620 50.7787 5.2113 34.7168 15.3916 19.2028 0.8807 1.8697 3.7819 5.0055 51.4861 22.5722 24.5977 63.6032 2.4650 7.3923 4.4449 22.1227 14.1624 10.4990 18.0163 53.8802 85.3866 14.6455 8.6631 37.8264 311.0166 221.8487 49.5058 18.1384 43.2674 73.9387 49.6288 30.1245 158.9660 109.4693 129.1889 122.5774 20.6778 19.4423 42.4912 3.6111 50.6182 47.2870 60.1320 33.0079 25.1695 17.7929 12.8177 22.6259 24.2185 23.4004 32.4577 15.9671 12.7366 18.4909 4.7445 13.7299 3.7690 8.3966 13.4501 8.4240
temp: 298.150 k
press: 1.00000 atm
elementType: 8 8 8 8 8 7 7 6 6 6 6 6 6 6 6 6 6 6 6 6 6 6 6 6 6 6 6 6 6 6 1 1 1 1 1 1 1 1 1 1 1 1 1 1 1 1 1 1 1 1 1 1 1 1 1 1 1 1 1 1
symmnumber: 1
zpe: 1293928.9 jmol-1
zpe.correction: 0.492832 hartree
zpe.thermalcorrener: 0.523193 hartree
zpe.thermalcorrenthalpy: 0.524137 hartree
zpe.thermalcorrgfe: 0.427825 hartree
zpe.sumelectzpe: -1377.723257 hartree
zpe.sumelectthermal: -1377.692896 hartree
zpe.sumelectthermalent: -1377.691952 hartree
zpe.sumelectthermalfe: -1377.788264 hartree
dipole: -0.0138 -5.0374 1.0347
dipole: 5.1426
quadrupole: -199.7909 -176.8398 -171.8002
quadrupole: 11.1241 -7.9849 -22.4820
quadrupole: -16.9806 5.9705 11.0101 11.1241 -7.9849 -22.4820
hfenergy: -1378.2160889 hartree
pointgroup: C01 [X(C23H30N2O5)]
dipole: -0.4290008 -1.8368032 0.7319136 debye
polarizability: 326.7931398|33.15857|324.7172741|-10.8458603|-34.4346855|224.5613118 unknown
InChI: InChI=1S/C23H30N2O5/c1-17(26)18-5-4-6-21(13-18)30-16-20(27)15-24-9-11-25(12-10-24)19-7-8-22(28-2)23(14-19)29-3/h4-8,13-14,20,27H,9-12,15-16H2,1-3H3
charge 0 multiplicity 1
60 atoms
O  -4.9814 -3.632554 -0.426301
O  -3.620963 -0.290237 -0.558715
O  6.084984 -1.610833 1.458907
O  6.541905 0.70106 0.24039
O  -2.661326 5.680987 -0.93193
N  -1.408877 -2.531348 0.233508
N  1.324809 -1.587996 0.090785
C  -0.347816 -3.14086 1.072309
C  -0.83243 -2.042592 -1.044739
C  0.757371 -2.111377 1.356222
C  0.283739 -1.01584 -0.783578
C  -2.570309 -3.42392 0.051463
C  -3.836663 -2.703116 -0.476297
C  2.605328 -0.956817 0.127021
C  -4.151242 -1.390802 0.269363
C  3.690478 -1.602786 0.795267
C  2.861975 0.276536 -0.5199
C  4.976523 -1.032049 0.824905
C  4.160299 0.84258 -0.507692
C  5.226731 0.213843 0.162274
C  -3.723129 1.015486 -0.05879
C  -3.150355 2.020539 -0.874482
C  -4.352828 1.361177 1.162554
C  -3.202343 3.376834 -0.476058
C  5.877086 -2.886383 2.142004
C  -4.398424 2.720836 1.555951
C  6.808371 1.973199 -0.428074
C  -3.831916 3.725688 0.752537
C  -2.607899 4.476015 -1.316635
C  -1.94098 4.115714 -2.640865
H  0.107376 -4.035495 0.576274
H  -0.794572 -3.467362 2.030746
H  -1.627056 -1.550372 -1.630387
H  -0.414308 -2.889472 -1.645197
H  1.551079 -2.584361 1.956285
H  0.32324 -1.280064 1.960301
H  -0.171207 -0.097481 -0.340348
H  0.740892 -0.743946 -1.751403
H  -2.356809 -4.287459 -0.626518
H  -2.815031 -3.850499 1.048672
H  -3.746389 -2.465179 -1.548989
H  -3.665183 -1.365988 1.264952
H  -5.250504 -1.283241 0.363708
H  3.527831 -2.581405 1.25449
H  2.058691 0.824155 -1.019415
H  -5.040505 -4.025865 0.482538
H  4.320329 1.797502 -1.017593
H  -2.678149 1.713532 -1.812618
H  -4.804977 0.597024 1.80124
H  6.857037 -3.141911 2.571359
H  5.562254 -3.679465 1.434706
H  5.126603 -2.795268 2.952626
H  -4.885699 2.985873 2.500634
H  6.618329 1.906744 -1.518243
H  6.199307 2.79366 0.001573
H  7.875565 2.172055 -0.250046
H  -3.859287 4.780644 1.041143
H  -1.090405 3.426583 -2.482097
H  -2.652892 3.611429 -3.320411
H  -1.574561 5.036148 -3.119684
