program: Gaussian 09
title: toluene with different orientation.
version: ES64L-G09RevE.01
frameworkgroup: C1[X(C31H62FeN3NaSi2)]
method: UwB97XD
basis: Gen
operation: Freq
keyword: #P
keyword: Geom=AllCheck
keyword: Guess=TCheck
keyword: SCRF=Check
keyword: GenChk
keyword: UwB97XD/ChkBas
keyword: Freq
converged: YES YES NO NO
polarizability: 4.33671939e+02 6.27345324e+00 4.28906606e+02 -7.80469615e+00 4.31590365e+00 3.80974727e+02
1716.lowfreq: -10.7177 -4.5324 0.0010 0.0015 0.0016 9.1089 27.3858 35.0434 40.8865
redmass: 4.7211 4.2877 3.9958 3.8011 3.3166 3.8980 4.1086 3.3934 3.6793 4.1872 3.4011 3.7919 4.8439 3.3302 4.0394 3.9966 3.6883 3.7818 2.9968 4.2462 3.2617 2.7636 1.2657 2.2267 2.3661 3.8787 3.9032 2.1176 3.2929 1.9282 3.2447 2.7497 1.3852 1.7997 1.6277 1.2840 1.7740 1.6417 1.4319 1.9897 1.5294 1.7902 2.8236 2.1760 2.0132 1.7325 2.0632 2.1604 1.4284 1.7242 1.9729 1.4647 1.8895 2.0952 1.5582 1.2654 1.5150 2.0407 1.8495 1.5010 1.5411 1.8293 2.4529 2.6018 1.4294 2.3884 2.3054 4.4325 2.8484 2.3471 2.4819 1.9055 1.9317 2.4262 2.5525 2.7401 2.9671 2.8687 2.6159 2.4351 3.8081 5.0170 3.2230 2.2285 2.3231 3.6933 3.6088 6.3045 2.3372 2.2125 1.9157 2.0310 1.3048 1.1739 2.8568 2.8380 2.7540 2.6732 1.5916 1.4444 2.6927 1.3892 2.8228 1.4673 3.9757 1.7111 1.4856 1.5011 1.5552 1.5189 1.6454 1.5233 1.7415 1.9544 1.2848 2.1203 2.3546 2.1564 2.0236 1.6215 1.5717 1.6067 1.7375 1.7343 1.9552 1.4151 9.3976 1.6412 1.6740 1.6490 1.6464 1.3560 1.6744 1.3606 1.3419 1.7494 1.8258 1.5247 1.3820 2.3563 2.2330 2.1719 1.5476 1.6063 1.5968 1.5435 1.5186 1.4052 1.4155 1.4545 2.1460 2.0868 1.1194 2.5044 2.4450 1.1497 2.2824 2.8945 2.3721 3.2813 2.7215 1.9934 1.8120 2.4650 1.9738 2.2464 1.2955 2.0359 1.2641 1.2525 1.2598 1.2449 1.2319 1.2895 1.2946 3.8162 1.4788 1.4688 1.4522 1.6176 1.4639 1.3028 1.3482 1.5007 1.4697 1.3531 1.3322 1.2510 1.2331 1.2337 1.2511 1.2368 1.0558 1.0535 1.0556 1.0564 1.0534 1.0591 1.0663 1.0584 1.0782 1.0723 1.0557 1.4239 1.0673 1.0693 1.0743 1.0653 1.0599 1.0721 1.0559 1.0597 1.0570 1.0463 1.0550 1.0528 1.0558 1.0949 1.0639 1.0591 1.0642 1.0568 1.0759 1.2977 1.0646 1.0563 1.0629 1.0643 1.0544 2.3164 5.5619 5.7393 1.0383 1.0621 1.0614 1.0404 1.0380 1.0424 1.0415 1.0455 1.0529 1.0493 1.0592 1.0416 1.0462 1.0384 1.0484 1.0569 1.0407 1.0376 1.0493 1.0511 1.0420 1.1000 1.0969 1.0982 1.1052 1.0993 1.0986 1.0967 1.1011 1.0977 1.1000 1.0969 1.1014 1.0995 1.1002 1.1001 1.0978 1.0988 1.0990 1.0996 1.1009 1.0966 1.0969 1.0959 1.0988 1.1007 1.0978 1.1012 1.1025 1.0997 1.0971 1.0969 1.0939 1.0970 1.0941 1.0961 1.0950 1.0895 1.0876 1.0936 1.0927 1.0972
irintensity: 0.0250 0.1068 0.0933 0.0764 0.1073 0.0850 0.0636 0.3561 0.7552 0.3240 0.2701 0.7308 1.9134 0.3484 0.1406 0.0548 0.6867 0.5988 0.3293 3.3308 1.8659 0.0324 0.5933 0.3376 0.9652 5.7423 7.2339 5.2367 13.0374 5.8302 11.2465 16.6623 2.6692 9.2691 0.5775 0.3305 5.2035 2.5684 1.6320 3.6492 1.2983 2.1324 1.9839 3.6437 14.1316 5.9923 4.4137 0.2557 1.8630 3.5415 1.5542 1.0588 1.1248 7.9224 3.3093 0.1137 0.2846 1.2448 0.7160 0.2708 0.7663 0.2285 0.5757 7.9967 0.2709 4.4835 2.1073 65.2977 0.0320 1.6305 0.1247 2.1002 5.0240 1.2799 1.2823 9.2169 5.7687 3.1930 7.1834 0.3239 33.1172 1.2011 25.9825 0.2896 0.4115 16.0005 9.3553 0.1064 15.0974 6.0010 15.1222 6.8760 5.0669 0.3992 15.3325 23.0550 12.7779 9.3242 3.2047 84.7753 1.4614 41.9071 2.2475 25.4499 4.3099 39.3727 37.6822 36.0986 25.3138 5.0043 165.2963 36.2131 129.2440 2.2248 15.0911 1.8660 111.0521 144.5388 50.3999 0.1798 0.3495 0.8419 1.1076 0.4879 21.8922 2.5365 388.0368 9.8521 11.7908 2.1720 3.8887 0.3269 0.7804 0.9413 3.0965 2.2111 2.1502 0.3733 1.1699 28.1775 4.2096 20.1828 13.1863 1.9553 1.9939 4.1881 0.6017 1.4546 4.4386 4.0421 25.3020 60.7424 0.3315 49.2248 7.2224 0.6439 1.1563 4.3978 2.9855 9.5164 0.2687 0.2544 0.7124 33.8805 17.6837 69.6086 25.9159 61.5370 19.7623 45.4509 43.1380 56.4913 34.0923 4.7294 13.7533 0.6340 0.0435 0.1617 0.0955 4.5061 2.2046 5.1131 0.4058 2.7488 7.0164 17.6796 16.6840 8.8732 10.7109 8.7940 3.3848 7.8414 2.4565 3.0583 1.9666 0.3866 1.4601 1.2986 3.1825 0.5895 0.5984 1.3172 1.8097 0.1489 1.2276 1.0557 1.5662 0.7719 2.9843 6.9157 2.6498 10.9303 1.3719 11.1138 0.8892 8.3184 1.6441 7.9546 0.6032 1.7515 1.1137 0.2914 15.6373 14.4851 11.6711 7.6733 6.2107 4.1611 12.7122 14.0768 0.1621 7.0905 17.7414 12.4106 36.3665 9.9463 10.6332 14.0405 21.8813 39.7219 13.0112 46.4339 28.4933 68.5392 21.3239 4.2057 11.7170 64.3467 13.8102 12.3776 15.1210 40.4526 14.0339 40.2105 60.7683 35.6877 47.7054 5.9612 109.0351 25.6435 26.4344 22.0936 47.1102 19.8923 57.2742 20.8735 63.9379 1.5050 54.2574 39.7925 43.1765 9.8903 20.8812 11.1707 14.5496 23.8910 25.1888 12.3050 18.2747 43.9358 7.4499 24.7569 8.6752 27.7503 18.0986 1.9902 23.4937 13.2773 7.3445 4.9006 1.7236 4.4295 6.4910 6.5358
temp: 298.150 k
press: 1.00000 atm
elementType: 11 26 14 14 7 6 1 1 6 1 1 6 1 1 1 6 1 1 1 6 1 1 1 6 1 1 1 1 1 6 6 6 6 6 6 1 1 1 1 1 6 1 1 1 7 6 1 1 1 6 1 1 1 6 1 1 1 6 1 1 1 6 1 1 6 1 1 6 1 1 6 6 7 6 1 1 1 6 1 1 1 6 1 1 1 6 1 1 1 6 1 1 6 1 1 6 1 1 6 6
symmnumber: 1
zpe: 2339088.6 jmol-1
zpe.correction: 0.890912 hartree
zpe.thermalcorrener: 0.940431 hartree
zpe.thermalcorrenthalpy: 0.941375 hartree
zpe.thermalcorrgfe: 0.812279 hartree
zpe.sumelectzpe: -2246.608626 hartree
zpe.sumelectthermal: -2246.559106 hartree
zpe.sumelectthermalent: -2246.558162 hartree
zpe.sumelectthermalfe: -2246.687258 hartree
dipole: -7.3062 1.2386 -0.0118
dipole: 7.4105
quadrupole: -256.6309 -267.1588 -263.1409
quadrupole: 1.1461 -1.2768 0.4744
quadrupole: 5.6793 -4.8486 -0.8307 1.1461 -1.2768 0.4744
hfenergy: -2247.4995374 hartree
pointgroup: C01 [X(C31H62Fe1N3Na1Si2)]
dipole: -2.879862 -0.423176 0.1659533 debye
polarizability: 428.3718612|6.392201|433.0800955|-11.5574857|0.5726558|382.1013154 unknown
InChI: InChI=1S/2C9H18N.C7H8.C6H18NSi2.Fe.Na/c2*1-8(2)6-5-7-9(3,4)10-8;1-7-5-3-2-4-6-7;1-8(2,3)7-9(4,5)6;;/h2*5-7H2,1-4H3;2-6H,1H3;1-6H3;;/q;-1;;;+1;
charge 0 multiplicity 5
100 atoms
Na -1.88473766 -0.41162566 0.11040098
Fe 1.10365912 0.32706105 -0.05809555
Si -0.08088993 -2.73154865 -1.07330906
Si 0.42034559 -2.27851683 1.79810104
N  0.25553337 -1.60723773 0.20322428
C  -0.73876046 -1.85071831 -2.62380931
H  0.0373741 -1.31604035 -3.17820867
H  -1.54772911 -1.13556753 -2.42217096
C  1.31722464 -3.87197855 -1.62885853
H  2.22795733 -3.33644192 -1.90109008
H  1.57473847 -4.58675425 -0.84192216
C  -1.51563058 -3.89247517 -0.61697787
H  -1.81765656 -4.47748513 -1.4937324
H  -2.38706348 -3.31912257 -0.29112926
H  -1.27357117 -4.59643139 0.18346703
C  1.08264189 -4.05204854 1.87274027
H  2.10082152 -4.08279624 1.46902587
H  0.48905454 -4.79599494 1.33646147
H  1.13670281 -4.3662225 2.92140693
C  1.63357687 -1.35615514 2.90765079
H  1.68495113 -1.87285516 3.87338065
H  1.3786057 -0.31490954 3.10826906
H  2.63448036 -1.37526893 2.4662876
C  -1.28540026 -2.26438133 2.64855028
H  -2.01871063 -2.81425556 2.04593143
H  -1.66416552 -1.24343192 2.79512997
H  -1.25122427 -2.7325402 3.63842821
H  -1.15322178 -2.61018314 -3.29712957
H  0.98842032 -4.44694918 -2.50274714
C  -5.00816394 -0.08769156 0.9299718
C  -4.94457297 -1.41532731 1.34293295
C  -4.75158955 -2.44894941 0.41874674
C  -4.58474084 -2.11018547 -0.92783102
C  -4.62925121 -0.77967077 -1.34564041
C  -4.85267642 0.23598531 -0.41817453
H  -5.17583222 0.69750305 1.65982
H  -5.06070574 -1.65767421 2.39581025
H  -4.41843126 -2.8959329 -1.6589349
H  -4.50349308 -0.53938615 -2.39699946
H  -4.90199641 1.26990638 -0.74176536
C  -4.75401095 -3.88545231 0.87459909
H  -4.10058382 -4.02692405 1.74080201
H  -5.76378954 -4.18858935 1.17021786
H  -4.41597275 -4.55868002 0.08403765
N  3.00743576 0.66755344 -0.3769758
C  2.96733491 -0.75231121 -2.34762081
H  3.46195399 -1.54919913 -2.91593344
H  1.96532337 -1.10090336 -2.08975001
H  2.86097838 0.12591307 -2.99155457
C  2.89106404 2.95876276 0.42100645
H  1.87538801 2.75255256 0.76384297
H  3.32829064 3.7247054 1.07247289
H  2.8169828 3.36422045 -0.59310937
C  3.93725871 -1.6508932 -0.2210177
H  2.95791047 -2.01679945 0.0986671
H  4.4380021 -2.45497872 -0.7751756
H  4.52925462 -1.44190024 0.67492587
C  3.93348316 1.23700195 1.88237555
H  4.44860896 2.00888341 2.46731194
H  2.96488235 1.0481171 2.35200826
H  4.51516742 0.31398997 1.95505102
C  5.1545903 0.07106333 -1.58843844
H  5.0183831 0.72391891 -2.46131814
H  5.70470232 -0.8116141 -1.93580633
C  5.10896858 2.05970573 -0.17297473
H  5.63278845 2.70259372 0.54435044
H  4.95046697 2.65742246 -1.08093896
C  5.94334289 0.84630934 -0.54726017
H  6.91496733 1.15283498 -0.95048983
H  6.15059995 0.22516598 0.33327317
C  3.76454472 -0.38162288 -1.08781238
C  3.73340796 1.67805472 0.41466216
N  -0.51322109 1.6293523 0.01904425
C  -0.25301977 1.68966645 2.44984015
H  -0.59463302 2.13390245 3.39136957
H  -0.45499695 0.61519407 2.50177619
H  0.82931942 1.83144127 2.38211843
C  0.23056249 1.75159422 -2.30430153
H  0.05915964 0.67833099 -2.44210894
H  0.0939327 2.22390979 -3.28309265
H  1.27296627 1.90117979 -2.00078024
C  -2.4849836 2.1273491 1.54187916
H  -2.71112277 1.08404265 1.79601544
H  -2.79310973 2.71621641 2.41320196
H  -3.12248895 2.41643276 0.70583447
C  -2.16254667 2.13223196 -1.83874214
H  -2.24889824 2.57603229 -2.83709111
H  -2.38918544 1.06407229 -1.9454813
H  -2.93727699 2.58359461 -1.2157408
C  -0.67412837 3.8323701 1.26549242
H  0.40538605 3.98374803 1.37135176
H  -1.14166465 4.28284196 2.14933267
C  -0.45187498 3.85241737 -1.19157511
H  -0.7493516 4.32228901 -2.1370231
H  0.63048087 3.99347554 -1.09190988
C  -1.13408905 4.52530201 -0.00906094
H  -0.88139162 5.59050559 0.02219315
H  -2.22647623 4.47027939 -0.10682591
C  -0.97141154 2.31490788 1.25153678
C  -0.73767757 2.3364367 -1.26700838
