program: Gaussian 09
title: FeHMDS3 fragment
version: ES64L-G09RevE.01
frameworkgroup: C1[X(C18H54FeN3Si6)]
method: UwB97XD
basis: Gen
operation: Freq
keyword: #P
keyword: Geom=AllCheck
keyword: Guess=TCheck
keyword: SCRF=Check
keyword: GenChk
keyword: UwB97XD/ChkBas
keyword: Freq
converged: YES YES NO YES
polarizability: 3.76713891e+02 -4.81629363e-03 3.63851049e+02 3.30625152e-01 -5.83963469e-03 3.43665027e+02
1716.lowfreq: -13.7842 -7.4970 0.0008 0.0013 0.0020 4.6302 31.7056 44.0566 50.8689
frequency: 31.6452 44.0152 50.8519 52.8258 54.3243 68.7937 75.1542 76.8704 80.2993 89.5114 92.3928 97.2003 100.5979 101.8707 115.8636 116.6626 123.7538 125.5731 142.1462 144.9402 154.7913 155.3435 164.2526 166.8477 170.5364 171.6198 174.2926 178.6762 184.6226 190.5748 191.0244 194.5168 195.9595 198.2237 203.5981 207.9497 211.6972 211.8810 212.7829 215.3539 219.3881 221.0524 225.5866 226.4853 233.9187 235.3026 235.6783 238.7897 239.7177 242.2903 247.0176 252.7962 253.9394 255.3377 261.1911 262.2247 263.7864 267.2309 272.9102 275.3035 275.5296 277.0955 285.2093 289.2169 294.8230 295.6289 348.8318 362.8456 365.1354 380.9811 398.3597 400.9707 618.3717 619.2538 619.9591 622.8953 624.0223 626.5646 667.1697 667.3794 673.2922 673.4374 676.6191 676.8179 679.5584 683.6873 686.3815 686.8040 688.7209 689.7337 691.5517 691.6740 693.8889 696.9055 702.4127 703.1553 711.5937 738.7221 746.8878 763.8777 764.0257 764.3435 772.3184 772.3640 779.4048 779.6634 784.8109 785.0959 807.5758 815.3020 823.6868 853.6555 856.5331 857.7353 859.1907 861.0578 862.1468 865.0244 870.8238 872.2754 874.5461 879.6096 882.4622 885.8194 890.5169 893.3411 905.5205 908.9114 948.5949 1006.9179 1018.1335 1053.0430 1287.4967 1287.7743 1291.4742 1291.8813 1292.3416 1292.9433 1293.4916 1294.1816 1296.8863 1298.6681 1299.9844 1301.8713 1303.3525 1304.0469 1304.3011 1307.1783 1315.7057 1316.0838 1458.5082 1458.7224 1460.9851 1462.4737 1464.5169 1465.0447 1466.2598 1469.5278 1471.0393 1471.4075 1473.1323 1473.1776 1473.7542 1475.9605 1476.0603 1478.9226 1479.3135 1479.5532 1480.3725 1481.0782 1482.7526 1485.9751 1487.6050 1489.0175 1490.2714 1491.1602 1494.0815 1495.7537 1498.1979 1498.5568 1498.8265 1502.6546 1504.9670 1507.4623 1508.0078 1509.5873 3050.0667 3050.1653 3050.6104 3050.6788 3052.8414 3052.9062 3053.1876 3053.4240 3053.9328 3054.0599 3055.5201 3055.8908 3055.9608 3056.0821 3057.6739 3057.7745 3058.9663 3059.2681 3130.1845 3130.2887 3131.1060 3131.7258 3132.2875 3132.3331 3133.9888 3134.0157 3136.3783 3136.4417 3137.8815 3138.1220 3139.2526 3139.4610 3141.3102 3141.5159 3143.2657 3143.6424 3145.0487 3145.3332 3157.5195 3157.6340 3158.5631 3158.7067 3158.9861 3159.0593 3159.5821 3162.7287 3162.8645 3164.2639 3164.4159 3165.4815 3166.8252 3166.9160 3173.2116 3173.3509
redmass: 3.7554 2.9826 2.9026 3.4025 3.4914 3.7172 4.6720 4.1474 3.0895 4.3074 2.9833 3.9469 3.0375 3.1425 3.7074 3.6738 3.3109 2.7086 2.3204 3.2101 1.2181 1.2194 1.2459 1.5076 2.2053 1.9803 2.5683 1.8061 2.0644 1.6632 1.5824 2.2572 1.6762 1.4720 1.4744 2.1502 1.6787 1.8037 1.8332 1.6167 1.4286 1.2200 1.7256 2.3228 1.8550 1.9998 2.0734 1.6923 1.6053 1.0920 1.7014 1.9450 2.1338 1.7393 1.6675 1.9606 1.8892 2.0463 2.3133 1.6815 1.6932 1.3964 1.5103 2.3220 1.5451 1.6064 4.5604 4.2836 4.1529 3.2427 3.7742 3.7286 3.5401 3.6814 3.5918 3.5082 3.6627 3.6485 2.3265 2.3341 2.1317 2.1346 1.9918 2.2735 1.3253 1.5786 1.8944 1.8892 1.7314 1.6475 1.8697 1.5281 1.3453 1.2078 1.2947 1.2679 3.2730 3.3144 2.6115 1.5145 1.4969 1.5118 1.5924 1.5951 1.5290 1.5273 1.5006 1.5032 1.6256 1.6818 1.6446 1.5270 1.5273 1.5494 1.4848 1.5274 1.5114 1.5033 1.6753 1.5642 1.5138 1.5727 1.7202 1.5762 1.8178 1.8072 1.8069 1.8739 2.4529 12.7458 11.7500 12.9045 1.2778 1.2759 1.2730 1.2731 1.2681 1.2694 1.2727 1.2693 1.2630 1.2655 1.2520 1.2561 1.2557 1.2506 1.2542 1.2442 1.2414 1.2433 1.0527 1.0529 1.0522 1.0520 1.0534 1.0527 1.0539 1.0522 1.0517 1.0539 1.0524 1.0510 1.0515 1.0514 1.0511 1.0516 1.0522 1.0504 1.0512 1.0518 1.0523 1.0524 1.0522 1.0517 1.0521 1.0510 1.0501 1.0504 1.0486 1.0491 1.0503 1.0495 1.0497 1.0489 1.0486 1.0484 1.0361 1.0361 1.0392 1.0389 1.0372 1.0372 1.0374 1.0380 1.0377 1.0378 1.0371 1.0370 1.0365 1.0365 1.0365 1.0365 1.0368 1.0366 1.0994 1.0994 1.1001 1.0999 1.0998 1.0997 1.1003 1.1004 1.0969 1.0967 1.0995 1.0997 1.0982 1.0981 1.0988 1.0988 1.0979 1.0981 1.1005 1.1002 1.1002 1.1002 1.1001 1.1000 1.1000 1.0999 1.0998 1.1004 1.1003 1.0998 1.0997 1.0982 1.0997 1.0997 1.0966 1.0965
irintensity: 0.0143 0.0127 0.0060 0.0170 0.0229 0.0840 0.1924 0.0883 0.0599 0.0466 0.0723 0.1021 0.0725 0.0833 0.4317 0.2212 0.4680 0.2817 1.1873 1.0798 0.0665 0.3328 0.0104 0.9997 1.9842 0.1517 0.9127 0.5723 1.4127 1.0949 1.2704 3.0375 0.9583 0.4461 1.2288 0.0254 0.9059 0.1085 0.4439 1.0679 0.7325 0.3180 0.0155 0.7516 5.9440 0.5261 5.6046 1.3815 2.5340 1.1026 2.2342 0.1736 1.2566 1.3013 0.9070 0.0564 0.9446 0.0060 3.1680 1.9597 1.5662 0.1236 3.6053 2.3077 1.8553 0.9264 25.4007 23.8554 38.6839 3.0868 19.3777 22.7914 5.6124 34.9376 0.0007 6.7936 2.5208 16.9577 2.9376 16.9014 5.9417 13.3567 38.0123 0.7814 4.5141 0.9289 38.6564 9.5532 25.4485 1.9174 4.6268 6.3009 0.1052 0.2893 3.2884 1.2665 33.2524 41.4914 4.1839 1.1863 2.9553 1.3478 3.1904 8.6950 33.6150 7.1993 52.5493 10.2388 102.3632 60.4596 8.7971 4.8960 0.0781 40.3367 70.6773 48.2945 17.0001 34.8658 194.8696 9.2503 120.3371 177.7246 409.8446 29.5538 59.1661 294.9357 290.8023 401.4464 3.1080 129.3268 697.8524 626.8562 3.0368 93.3761 35.0949 2.0255 10.4586 11.1054 72.8269 71.8208 25.3069 59.9987 28.6538 59.4562 146.0257 9.9450 77.7143 1.3962 9.1888 7.1158 3.6094 0.4195 1.4469 6.3269 0.0423 2.2148 3.6553 3.1433 0.0818 0.0106 3.5459 2.0890 0.3127 5.2321 1.3337 0.1868 2.6337 0.7657 0.3999 0.0420 9.4640 0.1557 0.6470 0.0519 0.4322 0.0023 1.7265 0.0372 4.8231 0.4743 4.6705 0.6388 0.3086 13.9619 0.9666 1.6720 7.1580 4.4291 24.0060 13.7352 5.3905 7.9821 9.2182 17.1769 37.5145 1.0666 28.9674 16.7324 3.7072 1.3915 3.5854 46.5052 77.2312 0.9844 9.8146 34.0711 29.2993 0.0539 42.8534 15.1559 25.4260 52.3105 5.0438 13.5811 73.7009 41.4059 64.0356 29.1533 25.0078 11.0853 78.2958 0.1545 22.4660 9.5745 28.8579 65.0404 1.7233 3.7298 33.2553 5.8160 25.7846 5.1198 3.6268 2.6246 16.6033 5.2073 5.5685 11.8381 5.4519 6.3237
temp: 298.150 k
press: 1.00000 atm
elementType: 26 14 14 14 14 14 14 7 7 7 6 1 1 6 1 1 6 1 1 1 6 1 1 1 6 1 1 1 6 1 1 1 6 1 1 1 6 1 1 1 6 1 1 1 6 1 1 6 1 1 1 6 1 1 1 6 1 1 1 6 1 1 6 1 1 6 1 1 1 6 1 1 1 6 1 1 1 1 1 1 1 1
symmnumber: 1
zpe: 1830868.1 jmol-1
zpe.correction: 0.697341 hartree
zpe.thermalcorrener: 0.747279 hartree
zpe.thermalcorrenthalpy: 0.748224 hartree
zpe.thermalcorrgfe: 0.618682 hartree
zpe.sumelectzpe: -2742.618207 hartree
zpe.sumelectthermal: -2742.568269 hartree
zpe.sumelectthermalent: -2742.567325 hartree
zpe.sumelectthermalfe: -2742.696866 hartree
dipole: -0.0004 -0.0332 -0.0002
dipole: 0.0332
quadrupole: -276.6876 -270.6961 -257.2955
quadrupole: -0.0017 -0.3171 -0.0011
quadrupole: -8.4612 -2.4697 10.9309 -0.0017 -0.3171 -0.0011
hfenergy: -2743.3155481 hartree
pointgroup: C01 [X(C18H54Fe1N3Si6)]
dipole: -0.0129859 0.0012669 0.0007919 debye
polarizability: 363.8800028|1.0195299|375.8038367|-1.5445497|-5.0372022|344.5461277 unknown
InChI: InChI=1S/3C6H18NSi2.Fe/c3*1-8(2,3)7-9(4,5)6;/h3*1-6H3;/q3*-1;+3
charge -1 multiplicity 5
82 atoms
Fe 0.94627852 -0.03635386 0.03235483
Si -0.63442164 2.50694247 1.06331603
Si 0.37568369 2.62560045 -1.75481919
Si 0.00993597 -2.53601632 1.89838748
Si -1.23708047 -2.17351894 -0.80142163
Si 3.85286639 0.8556747 0.86377214
Si 3.4948245 -1.51768787 -1.08397695
N  0.17680609 1.78148163 -0.26703263
N  -0.15701536 -1.65223976 0.42982848
N  2.93359929 -0.25086967 -0.0716781
C  -1.10624681 1.21481033 2.35596683
H  -0.2276722 0.74121084 2.80825061
H  -1.69677232 0.41814383 1.89306541
C  0.40701733 3.83010306 1.94068641
H  1.40786301 3.44964098 2.16799424
H  0.52935529 4.71928081 1.31354968
C  -2.25567986 3.36984523 0.57516205
H  -2.76732926 3.75876158 1.46383144
H  -2.93313466 2.67244783 0.0702141
H  -2.08006453 4.21423525 -0.10081099
C  0.87973149 4.44720917 -1.5267771
H  1.7806547 4.56060001 -0.91651075
H  0.07848146 5.02413117 -1.05034478
H  1.07430493 4.90302547 -2.5052777
C  1.67494298 1.80101436 -2.84573688
H  1.96216694 2.4578918 -3.67539827
H  1.27454303 0.87683627 -3.27515299
H  2.56911011 1.53657793 -2.27395586
C  -1.19557549 2.72774045 -2.81936805
H  -2.03262984 3.17003343 -2.26961979
H  -1.50852625 1.7380609 -3.16387108
H  -1.00852184 3.35047609 -3.70348577
C  1.56024282 -2.01920914 2.84049526
H  2.42640191 -1.94427973 2.17675879
H  1.7851758 -2.73176143 3.64299364
H  1.41198828 -1.03610747 3.29914257
C  0.08829129 -4.42047402 1.63947712
H  0.87523509 -4.71600908 0.93925139
H  -0.86285502 -4.80824015 1.25632561
H  0.28306254 -4.91838629 2.59719798
C  -1.42869602 -2.3133698 3.12041252
H  -1.28832471 -2.97168284 3.98723386
H  -2.39289505 -2.56098043 2.66488816
H  -1.48644374 -1.2837399 3.48457581
C  -0.59821226 -3.67906065 -1.76603069
H  -0.60696111 -4.58103009 -1.14532338
H  0.432738 -3.51983655 -2.09755779
C  -2.94596033 -2.67584339 -0.13900675
H  -2.88580206 -3.54580669 0.52456283
H  -3.61768449 -2.93660907 -0.96579156
H  -3.40319466 -1.85566102 0.42535814
C  -1.55324704 -0.7967236 -2.05347326
H  -0.64525104 -0.51596224 -2.59886948
H  -1.91020619 0.10224861 -1.54151837
H  -2.30469843 -1.10612607 -2.79000876
C  3.10581848 1.14036723 2.58264087
H  3.55394479 2.0241399 3.05354258
H  3.28689244 0.27868451 3.23235789
H  2.02405127 1.30020382 2.53480853
C  3.95405007 2.56246294 0.05634953
H  2.93974592 2.95963546 -0.04617812
H  4.39631809 2.51062257 -0.94487338
C  5.63796339 0.3065332 1.2185772
H  6.28903857 0.39747829 0.34437873
H  5.67622587 -0.73350335 1.56218938
C  3.31431127 -3.21542336 -0.27135292
H  3.67267903 -4.02217249 -0.92198904
H  2.25499583 -3.38904952 -0.059753
H  3.85881315 -3.2694046 0.67803412
C  2.53031168 -1.6189883 -2.71280147
H  2.8215718 -0.80823702 -3.3875354
H  1.45015303 -1.54651778 -2.55140362
H  2.72977423 -2.57247101 -3.21748469
C  5.30921776 -1.35658682 -1.62811524
H  5.53182399 -0.34461686 -1.98527921
H  5.49896019 -2.05137235 -2.45540377
H  6.01315558 -1.59374612 -0.82522353
H  -1.69509961 1.66850262 3.16237836
H  -0.06031718 4.14300688 2.88245684
H  -1.21474408 -3.87330493 -2.65226073
H  4.54105418 3.26698981 0.65773279
H  6.05579747 0.93594268 2.01381145
