program: Gaussian 09
title: guf37b
version: ES64L-G09RevD.01
method: RB3LYP
basis: GenECP
operation: Freq
keyword: #T
keyword: Geom=AllCheck
keyword: Guess=TCheck
keyword: SCRF=Check
keyword: GenChk
keyword: RB3LYP/GenECP
keyword: Freq
hfenergy: -1446.0687907 hartree
pointgroup: C01 [X(C23H40N2P1Ru1)]
dipole: -0.6820351 0.8721042 -0.9300876 debye
polarizability: 325.1685793|-22.2793237|304.2461467|8.2466397|-0.7540306|317.4984284 unknown
InChI: InChI=1S/C14H27N2P.C5H5.C4H8.Ru/c1-10(2)17(11(3)4)13-15-12(9-16(13)8)14(5,6)7;1-2-4-5-3-1;1-3-4-2;/h9-11H,1-8H3;1-5H;3-4H,1-2H3;/q-1;;;+1
charge 1 multiplicity 1
67 atoms
Ru 0.31501865 -0.12387567 1.10898462
P  -1.16104291 1.19604153 -0.34534791
C  -0.5160926 2.9744135 -0.55378305
C  0.90796651 2.94672004 -1.12676276
C  -1.38355473 3.92670842 -1.38601309
C  -2.96419785 1.33974425 -0.89807659
C  -3.82287179 1.98377102 0.19936808
C  -3.60079251 0.0688694 -1.47233738
C  -0.30190465 0.23126615 -1.62881307
N  0.61746498 -0.52415968 -1.01845584
C  1.30220252 -1.21852858 -1.99331185
C  0.75379694 -0.85880185 -3.21172744
N  -0.2479107 0.05828944 -2.9699758
C  2.47741934 -2.13289279 -1.73860359
C  2.15383558 -3.12330043 -0.60731928
C  2.81652438 -2.91209563 -3.01877616
C  3.69394974 -1.27084823 -1.34125583
C  -1.09010747 0.70174851 -3.96935029
C  0.72930637 0.81490732 3.07241225
C  1.3463126 1.64717982 2.08102666
C  2.31263711 0.87638793 1.3874327
C  2.3353954 -0.44889952 1.95902837
C  1.37680982 -0.46962059 3.00785344
H  -0.48106121 3.34945481 0.48307767
H  1.36569577 3.9448082 -1.03065669
H  0.87970858 2.6866854 -2.19815383
H  1.54620174 2.21225995 -0.62292582
H  -1.4636471 3.58265695 -2.43173528
H  -0.89956985 4.91729374 -1.40553639
H  -2.39710616 4.05507395 -0.98050526
H  -2.8906055 2.05613101 -1.73007622
H  -3.36684941 2.9071508 0.59262208
H  -3.97732312 1.29311359 1.04030728
H  -4.81034569 2.24625202 -0.21508847
H  -2.94582261 -0.4311855 -2.20237786
H  -3.86703305 -0.6626011 -0.6967124
H  -4.53536022 0.35023855 -1.98594351
H  0.99718587 -1.18052871 -4.21869529
H  1.32796595 -3.79349696 -0.89437269
H  3.0416295 -3.74009915 -0.3934567
H  1.86259592 -2.58567482 0.30474632
H  1.96202257 -3.52602107 -3.34765504
H  3.10054981 -2.23163192 -3.83865614
H  3.66933615 -3.58151672 -2.82634976
H  4.5629098 -1.91979318 -1.14280208
H  3.95826289 -0.57277562 -2.1526186
H  3.48248272 -0.68628948 -0.435318
H  -1.79485446 -0.02380623 -4.40457758
H  -1.65425217 1.50982548 -3.48599678
H  -0.46150183 1.1250475 -4.76664034
H  -0.03445417 1.11595424 3.78431237
H  1.08941427 2.6815937 1.86838312
H  2.93446976 1.21769255 0.56415701
H  2.99301777 -1.2638031 1.67239973
H  1.14870247 -1.32930496 3.63374927
C  -1.39903391 -2.56081276 -0.14430501
C  -0.70124537 -2.12084295 1.11773604
C  -1.30877496 -1.32408962 2.10153519
H  -2.04031422 -3.43665596 0.06527463
H  -2.0374091 -1.76960385 -0.55690747
H  0.08549782 -2.80110924 1.45760382
H  -0.9408079 -1.44913185 3.12222493
H  -0.67620819 -2.85042977 -0.92000093
C  -2.72977144 -0.83139073 2.06510998
H  -2.83817517 0.12170912 2.6060523
H  -3.38375885 -1.57226345 2.56333569
H  -3.09421777 -0.69557542 1.04323292
