program: Gaussian 09
title: guf11b
version: ES64L-G09RevD.01
method: RB3LYP
basis: GenECP
operation: Freq
keyword: #T
keyword: Geom=AllCheck
keyword: Guess=TCheck
keyword: SCRF=Check
keyword: GenChk
keyword: RB3LYP/GenECP
keyword: Freq
hfenergy: -1446.0527352 hartree
pointgroup: C01 [X(C23H40N2P1Ru1)]
dipole: 0.2632498 0.1447003 -2.3135139 debye
polarizability: 324.8277109|-6.9216664|298.2430264|-4.810707|-12.9772645|326.1229242 unknown
InChI: InChI=1S/C14H28N2P.C5H5.C4H7.Ru/c1-10(2)17(11(3)4)13-15-12(9-16(13)8)14(5,6)7;1-2-4-5-3-1;1-3-4-2;/h9-11,15H,1-8H3;1-5H;3-4H,1H2,2H3;
charge 1 multiplicity 1
67 atoms
Ru -0.49553597 -0.35111082 1.62313689
P  -1.26877558 0.57935227 -0.35390624
C  -1.6114084 2.44812671 -0.66872801
C  -0.52080366 3.15440798 -1.49276608
C  -2.98430969 2.79005228 -1.26423504
C  -2.72796406 -0.28123855 -1.19891532
C  -3.90250739 -0.37822362 -0.21403559
C  -2.38659835 -1.6632947 -1.77201645
C  0.10479902 0.28820514 -1.60195565
N  1.3210534 -0.00657812 -1.11872442
C  2.25504395 -0.12611927 -2.1261443
C  1.55828729 0.10266961 -3.28553476
N  0.23774434 0.35923757 -2.94089061
C  3.7001209 -0.44176527 -1.84957434
C  3.79073352 -1.8437703 -1.21274802
C  4.4912493 -0.4108094 -3.1641122
C  4.25894926 0.60873445 -0.86781614
C  -0.83227954 0.61515861 -3.90155643
C  0.26870057 -1.94263825 2.98173328
C  0.84026043 -2.15209933 1.6843601
C  -0.23106804 -2.40306923 0.77900959
C  -1.46923804 -2.39582073 1.52552603
C  -1.15315876 -2.10194879 2.87914109
H  -1.58468883 2.86312054 0.34841455
H  -0.65179686 4.24458172 -1.3928258
H  -0.61411167 2.91215471 -2.56279434
H  0.49686791 2.90687423 -1.16598977
H  -3.07337993 2.457626 -2.3122337
H  -3.09661389 3.88718563 -1.26435991
H  -3.82302535 2.3680613 -0.69561854
H  -3.02865732 0.36807216 -2.03361137
H  -4.20869304 0.60250648 0.17802993
H  -3.63182955 -1.00043852 0.65005782
H  -4.77023941 -0.82964812 -0.72333798
H  -1.50012043 -1.6497017 -2.42625484
H  -2.20894854 -2.39794785 -0.97686693
H  -3.24196601 -2.02343211 -2.36781894
H  1.88858139 0.10460018 -4.31892921
H  3.39595273 -2.6145912 -1.89423706
H  4.84307223 -2.07933671 -0.98806466
H  3.22337536 -1.88775091 -0.2679876
H  4.10784431 -1.16106671 -3.87533472
H  4.44013657 0.58499199 -3.63424682
H  5.54848495 -0.64167132 -2.96269328
H  5.3137864 0.38098735 -0.64754682
H  4.20123478 1.62184565 -1.29771626
H  3.70416163 0.60262347 0.08611353
H  -1.63208983 1.17446978 -3.40484042
H  -0.42959559 1.21409404 -4.72971584
H  -1.23020613 -0.33602589 -4.28653055
H  0.8216198 -1.71887677 3.89079688
H  1.90056668 -2.14023069 1.44384072
H  -0.12495418 -2.62431039 -0.27997298
H  -2.45541399 -2.63036664 1.13973081
H  -1.86524874 -2.00884685 3.69592791
C  -1.38423776 1.33391148 2.77284195
C  -0.02686407 1.08761397 3.11463413
C  1.01705668 1.19130853 2.13198051
H  -2.14393669 1.09597194 3.52143325
H  -1.64150044 2.16241694 2.11360454
H  0.18647115 0.59153571 4.06533792
H  1.9583205 0.73377155 2.46473753
H  1.42793391 -0.11502866 -0.09521974
C  1.2498374 2.44413058 1.31646813
H  1.76762496 2.23070585 0.36636597
H  1.89061411 3.14918633 1.87830837
H  0.31132511 2.96612622 1.09174987
