program: Gaussian 09
title: iuf35b
version: ES64L-G09RevD.01
method: RB3LYP
basis: GenECP
operation: Freq
keyword: #T
keyword: Geom=AllCheck
keyword: Guess=TCheck
keyword: SCRF=Check
keyword: GenChk
keyword: RB3LYP/GenECP
keyword: Freq
hfenergy: -1446.0491653 hartree
pointgroup: C01 [X(C23H40N2P1Ru1)]
dipole: 2.0049498 1.4749487 0.2786353 debye
polarizability: 341.0224983|9.9894386|331.333418|4.855157|2.5682393|283.0760576 unknown
InChI: InChI=1S/C14H28N2P.C5H5.C4H7.Ru/c1-10(2)17(11(3)4)13-15-12(9-16(13)8)14(5,6)7;1-2-4-5-3-1;1-3-4-2;/h9-11,15H,1-8H3;1-5H;3-4H,1H2,2H3;
charge 1 multiplicity 1
67 atoms
Ru -1.41696843 -0.70559227 0.0591792
P  -0.45998983 1.38118836 0.21888159
C  1.41453505 1.11101124 0.12853512
N  2.53929941 1.85282662 0.21615333
C  3.64682567 1.03505266 0.02578648
C  3.19120277 -0.23970349 -0.19383203
N  1.81918746 -0.14282158 -0.12301437
C  2.61395032 3.28605653 0.48950138
H  1.81758437 3.80375239 -0.05815566
H  3.5893063 3.65499813 0.14622522
H  2.50614354 3.4766718 1.56744207
H  4.65730214 1.42885334 0.05946563
C  -0.6640855 2.20636116 1.9257456
C  -0.69296299 3.73906737 1.95423428
C  0.35015941 1.67170148 2.94599166
C  -0.60529321 2.83156502 -0.99095262
C  0.229218 2.67221781 -2.27084548
C  -2.08811034 3.11444708 -1.27675734
H  -1.6643323 1.84317101 2.20836002
H  -0.20880415 3.70411901 -0.45156893
H  -1.47024755 4.15722672 1.29796195
H  0.27638675 4.17587114 1.66605923
H  -0.90881123 4.06899381 2.98427183
H  1.36811531 2.0318758 2.72288923
H  0.08393551 2.03442827 3.95275046
H  0.37838484 0.57519553 2.9768153
H  -0.02085767 1.76529008 -2.84140046
H  0.04742744 3.5384319 -2.92932744
H  1.30888747 2.63788477 -2.05302708
H  -2.6742623 3.19815205 -0.34701267
H  -2.17931991 4.06735251 -1.82427527
H  -2.54597168 2.32578327 -1.89037681
C  3.88458434 -1.54747162 -0.46462497
C  5.40337928 -1.3306286 -0.47584375
C  3.49950585 -2.54979335 0.64352428
C  3.41430465 -2.08635624 -1.83164211
H  5.9108042 -2.28742837 -0.6727548
H  5.69584643 -0.61915073 -1.26566305
H  5.75669773 -0.94893762 0.4963189
H  3.82269566 -2.18890706 1.63351704
H  3.98467985 -3.51926357 0.44848083
H  2.40848626 -2.71551918 0.66941308
H  2.32235217 -2.24606955 -1.84470441
H  3.90116902 -3.05383505 -2.03256191
H  3.67556692 -1.38747874 -2.64274095
C  -2.78722853 -1.66657839 1.55669961
C  -2.18887474 -2.68792972 0.73860102
C  -1.75180902 -1.00657548 2.26794983
H  -3.84709711 -1.43300236 1.61219129
C  -0.77665151 -2.6618666 0.97220877
H  -2.71681345 -3.38296167 0.09481966
C  -0.49514958 -1.62286603 1.90164045
H  -1.88114351 -0.19989176 2.98321254
H  -0.04459258 -3.32092168 0.51058167
H  0.48586958 -1.37977469 2.30085374
C  -0.8478395 -1.35638732 -1.97018157
C  -1.81210504 -0.31305416 -2.03851331
C  -3.08310335 -0.39543314 -1.41310559
C  -3.9926092 -1.59876857 -1.54981913
H  1.09515209 -0.87202066 -0.25301524
H  0.13147421 -1.15401835 -2.41506758
H  -1.16406929 -2.40219799 -2.02108297
H  -1.47930032 0.66086108 -2.38555769
H  -3.61921755 0.55499308 -1.34096321
H  -3.42373578 -2.51368573 -1.77072007
H  -4.59665378 -1.7740575 -0.64528004
H  -4.69464404 -1.43015701 -2.38662025
