program: Gaussian 09
title: iuf33a
version: ES64L-G09RevD.01
method: RB3LYP
basis: GenECP
operation: Freq
keyword: #T
keyword: Geom=AllCheck
keyword: Guess=TCheck
keyword: SCRF=Check
keyword: GenChk
keyword: RB3LYP/GenECP
keyword: Freq
hfenergy: -1446.0371339 hartree
pointgroup: C01 [X(C23H40N2P1Ru1)]
dipole: 2.2559915 1.3615282 0.4061613 debye
polarizability: 362.7782806|-3.0277402|336.3626181|2.1958843|3.0656928|263.4460905 unknown
InChI: InChI=1S/C14H28N2P.C5H5.C4H7.Ru/c1-10(2)17(11(3)4)13-15-12(9-16(13)8)14(5,6)7;1-2-4-5-3-1;1-3-4-2;/h9-11,15H,1-8H3;1-5H;3-4H,1H2,2H3;
charge 1 multiplicity 1
67 atoms
Ru -1.47727173 -0.74600302 -0.09045663
P  -0.32803086 1.25722109 -0.02743602
C  1.4920304 0.99769154 0.36265187
N  2.52363984 1.77135866 0.76470708
C  3.70291599 1.04039413 0.70377745
C  3.39864734 -0.20991772 0.23584194
N  2.03465307 -0.18756348 0.04251657
C  2.46817148 3.16531457 1.19599695
H  1.84788661 3.7417354 0.50024144
H  3.49032688 3.56502468 1.19359291
H  2.04670623 3.23281247 2.20856942
H  4.65217126 1.47242428 1.00065649
C  -0.98621172 2.45456356 1.27350514
C  -0.69586983 3.96351962 1.19838329
C  -0.72585578 1.87867651 2.67133294
C  -0.0144902 2.32887839 -1.56266886
C  0.68837618 1.48952453 -2.63697404
C  -1.29539794 2.95817535 -2.12693401
H  -2.06149756 2.33669534 1.06821089
H  0.65960475 3.14075526 -1.23573396
H  -0.57414572 4.33271067 0.16927365
H  0.19260663 4.24414059 1.77917293
H  -1.54520828 4.50781145 1.64370998
H  0.34793395 1.92701212 2.92778746
H  -1.27684209 2.46095941 3.42837956
H  -1.04992459 0.82696214 2.72783955
H  0.07903326 0.60379653 -2.8846322
H  0.82148923 2.0906784 -3.55169084
H  1.68389661 1.14340673 -2.31357288
H  -1.8756143 3.50302287 -1.36613294
H  -1.02367061 3.67338479 -2.92109481
H  -1.94262055 2.19084144 -2.57673348
C  4.23602798 -1.42828806 -0.04579895
C  5.71104314 -1.1056754 0.22961276
C  3.76756041 -2.57946666 0.86875912
C  4.05209341 -1.83118909 -1.52331715
H  6.32595791 -1.99493292 0.02324335
H  6.06555135 -0.28553251 -0.41624839
H  5.86424192 -0.8216822 1.28383469
H  3.88861759 -2.31253649 1.93115195
H  4.37014948 -3.47843799 0.6636231
H  2.7095303 -2.83252843 0.68948857
H  2.99798781 -2.06851946 -1.74917888
H  4.65076585 -2.73076214 -1.73599524
H  4.37907746 -1.02376294 -2.19823937
C  -2.174111 -2.84210176 0.24777426
C  -1.23020126 -2.88694726 -0.8215748
C  -1.48784131 -2.38727062 1.42869784
H  -3.21480446 -3.13838487 0.18778238
C  0.03161207 -2.46635573 -0.3257324
H  -1.43831434 -3.188304 -1.84506553
C  -0.1344571 -2.1424201 1.08111127
H  -1.92759593 -2.25317523 2.41327398
H  0.96011161 -2.54325242 -0.89062358
H  0.64656903 -1.81596872 1.76319906
C  -2.89228863 -0.31341043 -1.72816028
C  -3.12959817 0.55821156 -0.63474334
C  -3.40158781 0.07220615 0.67736098
C  -4.47775583 -0.95722735 0.95761145
H  1.44546799 -0.92636523 -0.34331539
H  -2.56728928 0.12667609 -2.67323298
H  -3.46694527 -1.23864194 -1.82367143
H  -2.89500909 1.61560686 -0.7566443
H  -3.32275011 0.82504605 1.46873577
H  -4.67613702 -1.5851982 0.07702087
H  -4.22453201 -1.61348709 1.80588323
H  -5.41820478 -0.43634702 1.21359083
