program: Gaussian 09
title: iuf25-27b
version: ES64L-G09RevD.01
method: RB3LYP
basis: GenECP
operation: Freq
keyword: #T
keyword: Geom=AllCheck
keyword: Guess=TCheck
keyword: SCRF=Check
keyword: GenChk
keyword: RB3LYP/GenECP
keyword: Freq
hfenergy: -1446.0428202 hartree
pointgroup: C01 [X(C23H40N2P1Ru1)]
dipole: -1.0350753 1.029916 -0.5133619 debye
polarizability: 332.283044|10.2733238|328.6431418|21.142209|-8.8378497|293.0276566 unknown
InChI: InChI=1S/C14H27N2P.C5H5.C4H7.Ru.H/c1-10(2)17(11(3)4)13-15-12(9-16(13)8)14(5,6)7;1-2-4-5-3-1;1-3-4-2;;/h9-11H,1-8H3;1-5H;3-4H,1H2,2H3;;
charge 1 multiplicity 1
67 atoms
Ru -1.91668344 -0.88238858 -0.52885182
P  -0.64111719 1.12988593 -0.36911517
C  1.09386175 0.6914187 0.04591901
N  2.19480053 1.50764133 0.13303231
C  3.24519474 0.7137487 0.5440167
C  2.74351337 -0.56151934 0.70543239
N  1.40582385 -0.55076091 0.39338195
C  2.3176915 2.92073259 -0.1920691
H  2.55438424 3.06707061 -1.25818801
H  3.12136594 3.35634527 0.41776313
H  1.38232536 3.43934918 0.04450061
H  4.24095831 1.12423297 0.68195767
C  -1.14182301 2.35316893 1.01656269
C  -1.36457935 3.81025055 0.58573678
C  -0.18779744 2.29119863 2.2225742
C  -0.47232861 2.19576341 -1.9118322
C  0.56138478 1.64043953 -2.90203282
C  -1.82791141 2.4780131 -2.57927078
H  -2.11652513 1.97241411 1.34710433
H  -0.08539599 3.1522177 -1.53155158
H  -2.09041907 3.90753047 -0.23342575
H  -0.43125383 4.30692586 0.27614165
H  -1.75544911 4.37167338 1.45067817
H  0.76188077 2.8030371 2.00814847
H  -0.66034809 2.80110071 3.07832771
H  0.06056857 1.26176432 2.52366294
H  0.32615624 0.6177909 -3.23040874
H  0.58966418 2.28547091 -3.79618158
H  1.57015592 1.60781956 -2.46703994
H  -2.62080014 2.70275611 -1.84934352
H  -1.72777715 3.34631851 -3.25079928
H  -2.1676997 1.62894983 -3.18676543
C  3.4416313 -1.82448718 1.1489057
C  4.9191938 -1.53545267 1.44671795
C  2.7501509 -2.36038794 2.41755134
C  3.33183173 -2.87717432 0.02889173
H  5.4241121 -2.45958338 1.76969085
H  5.43764872 -1.15827228 0.54917887
H  5.02271918 -0.78916989 2.25232087
H  2.82211859 -1.63138269 3.24200258
H  3.22868015 -3.30025341 2.73903321
H  1.68422926 -2.55957514 2.21817055
H  2.2737349 -3.07814737 -0.20571633
H  3.80751922 -3.81890037 0.34952361
H  3.83383502 -2.52679365 -0.88848538
C  -3.28140011 -0.72929444 -2.30794186
C  -1.94263835 -0.93466776 -2.77062664
C  -3.65405136 -1.90170315 -1.56543463
H  -3.91018699 0.13071178 -2.51889321
C  -1.48897681 -2.20678219 -2.30764072
H  -1.37303137 -0.25635201 -3.3919381
C  -2.55560051 -2.80662361 -1.5723233
H  -4.61258049 -2.07353703 -1.0828363
H  -0.51085647 -2.64228656 -2.49250198
H  -2.52435737 -3.77589374 -1.08623791
C  -3.37862582 -0.23936538 1.00935906
C  -2.18774117 -0.69184881 1.63096491
C  -1.74298598 -2.02159294 1.42801406
C  -2.65073837 -3.22655702 1.51641516
H  -0.3991118 -1.26248937 -0.24622556
H  -3.65537354 0.81317242 1.08174825
H  -4.21999858 -0.92391493 0.89637729
H  -1.50694584 0.01817394 2.09464116
H  -0.71006514 -2.20651273 1.73369302
H  -3.6541176 -3.03640406 1.10906802
H  -2.21821068 -4.09865514 1.00428942
H  -2.76162989 -3.49835708 2.58218101
