program: Gaussian 09
title: jug43
version: ES64L-G09RevD.01
method: RB3LYP
basis: GenECP
operation: Freq
keyword: #T
keyword: Geom=AllCheck
keyword: Guess=TCheck
keyword: SCRF=Check
keyword: GenChk
keyword: RB3LYP/GenECP
keyword: Freq
hfenergy: -1446.0447636 hartree
pointgroup: C01 [X(C23H40N2P1Ru1)]
dipole: 0.4039166 1.4793128 -0.1406 debye
polarizability: 322.9753564|0.2067693|334.2386601|-8.3691143|-10.7720222|290.2692243 unknown
InChI: InChI=1S/C14H27N2P.C5H5.C4H8.Ru/c1-10(2)17(11(3)4)13-15-12(9-16(13)8)14(5,6)7;1-2-4-5-3-1;1-3-4-2;/h9-11H,1-8H3;1-5H;3-4H,1-2H3;/q-1;;;+1
charge 1 multiplicity 1
67 atoms
Ru -1.1405429 -1.01632354 0.54716346
P  -0.8631818 1.37222201 0.51406659
C  0.80239067 0.91704729 -0.08570826
N  2.0135062 1.42600799 -0.41109715
C  2.89408216 0.36270356 -0.46504455
C  2.19076703 -0.78505265 -0.14874346
N  0.88350787 -0.41392332 0.07017713
C  2.33267403 2.8249453 -0.66521655
H  2.8242206 2.92374265 -1.64479485
H  2.99986173 3.21364141 0.11956712
H  1.39886144 3.40229408 -0.66851907
H  3.93487008 0.50229982 -0.73848869
C  -0.53199353 2.11153889 2.21267243
C  -0.08755107 3.57867479 2.18344565
C  0.49034644 1.24967256 2.96469287
C  -1.59214506 2.78155522 -0.46698201
C  -1.71391109 2.46042451 -1.95600962
C  -2.95764804 3.13039814 0.14533836
H  -1.50862414 2.03955912 2.72422524
H  -0.90743914 3.63544397 -0.33170421
H  -0.84821093 4.24412869 1.74931676
H  0.848823 3.69438844 1.61146941
H  0.10985343 3.92022206 3.21317968
H  1.48767287 1.34441387 2.50278748
H  0.56442937 1.59215787 4.0094292
H  0.2168833 0.18635414 2.95244508
H  -2.41683797 1.62988147 -2.11680807
H  -2.09571844 3.34671156 -2.48953261
H  -0.74486077 2.17938214 -2.39748336
H  -2.87976063 3.41589598 1.20664118
H  -3.40293499 3.97653665 -0.40303185
H  -3.64798401 2.27292679 0.06428172
C  2.69135475 -2.20258332 -0.00945668
C  4.16719098 -2.2788126 -0.42524492
C  2.55208352 -2.62205256 1.46794844
C  1.85575124 -3.15373483 -0.88713531
H  4.52722083 -3.31436728 -0.32303963
H  4.30042183 -1.97058561 -1.47553014
H  4.79449109 -1.6362005 0.2147487
H  3.13704668 -1.95446876 2.12195754
H  2.92082726 -3.65251672 1.59941155
H  1.49873448 -2.58283763 1.77781246
H  0.78211485 -3.04188713 -0.66736085
H  2.15057242 -4.19609872 -0.68424362
H  2.02185843 -2.95550322 -1.95806384
C  -3.05765675 -1.60131036 1.42728016
C  -2.4817216 -2.74023405 0.77919273
C  -2.12563504 -1.17936204 2.43866611
H  -4.0207427 -1.15109288 1.20331817
C  -1.22092815 -3.04992465 1.38149338
H  -2.91682296 -3.26081189 -0.07156346
C  -0.9948215 -2.06756875 2.40984041
H  -2.25461556 -0.34171337 3.12040534
H  -0.56590269 -3.87628225 1.12010632
H  -0.1303134 -2.01372317 3.06727194
C  0.49426867 -0.43419884 -3.09337921
C  -0.99479519 -0.49662717 -2.98303873
C  -1.7047983 -1.2721675 -2.14562244
C  -3.20987874 -1.33378391 -2.14972799
H  0.86800052 0.5667796 -2.80815995
H  0.80725215 -0.60277326 -4.13851404
H  0.98092111 -1.17596091 -2.45093248
H  -1.55587901 0.13904463 -3.67889483
H  -1.15187984 -2.00344979 -1.52287942
H  -3.62021487 -0.73274472 -2.97765956
H  -3.56463979 -2.3715705 -2.27740973
H  -3.63227145 -0.9587498 -1.20332844
