program: Gaussian 09
title: juf37a
version: ES64L-G09RevD.01
method: RB3LYP
basis: GenECP
operation: Freq
keyword: #T
keyword: Geom=AllCheck
keyword: Guess=TCheck
keyword: SCRF=Check
keyword: GenChk
keyword: RB3LYP/GenECP
keyword: Freq
hfenergy: -1446.0488706 hartree
pointgroup: C01 [X(C23H40N2P1Ru1)]
dipole: -1.3954792 1.026892 0.189968 debye
polarizability: 347.4000147|-9.4266064|328.8376872|11.2566258|-4.2100318|269.8717415 unknown
InChI: InChI=1S/C14H27N2P.C5H5.C4H7.Ru.H/c1-10(2)17(11(3)4)13-15-12(9-16(13)8)14(5,6)7;1-2-4-5-3-1;1-3-4-2;;/h9-11H,1-8H3;1-5H;3-4H,1H2,2H3;;
charge 1 multiplicity 1
67 atoms
Ru -1.37227325 -0.98501494 -0.38378555
P  -0.3571029 1.13801415 -0.12947667
C  1.45979517 0.87078266 0.01399
N  2.44446158 1.81802105 0.19828151
C  3.64566576 1.14335084 0.19819386
C  3.35289442 -0.19265269 0.01959168
N  1.99319522 -0.33901251 -0.09403836
C  2.34399464 3.26564168 0.31155809
H  2.4685612 3.75047893 -0.67084972
H  3.13081956 3.62593804 0.98968375
H  1.37173443 3.54132961 0.73274101
H  4.58581701 1.67023452 0.330144
C  -0.88480942 1.96806022 1.50235162
C  -1.27945453 3.45243437 1.44309626
C  0.14395 1.7109758 2.61605246
C  -0.34989866 2.3864038 -1.55501842
C  0.18626626 1.67235287 -2.8060475
C  -1.61736688 3.18817526 -1.88407739
H  -1.78844978 1.39404676 1.7521411
H  0.40604171 3.11625606 -1.23039618
H  -2.26104309 3.59242705 0.96979549
H  -0.55219482 4.07886055 0.90362447
H  -1.35373417 3.84152695 2.47237031
H  1.06838354 2.28698836 2.4640413
H  -0.29411017 2.02133785 3.5791576
H  0.42180066 0.65052974 2.69400608
H  -0.540668 0.93477868 -3.18222263
H  0.35844108 2.41695623 -3.60051876
H  1.13259468 1.14466923 -2.61026316
H  -1.99986078 3.75734552 -1.02921853
H  -1.35755307 3.91205021 -2.67453978
H  -2.43433293 2.56818425 -2.2766394
C  4.27940896 -1.38385248 -0.03416849
C  5.73942372 -0.92566641 0.08339985
C  3.939783 -2.3331894 1.13184926
C  4.07168434 -2.12467209 -1.3688239
H  6.4110329 -1.79777199 0.04252655
H  6.00857206 -0.24652709 -0.74287222
H  5.91532557 -0.40356003 1.03902958
H  4.090967 -1.83204277 2.10269482
H  4.58776569 -3.22457697 1.09503428
H  2.88965451 -2.66255634 1.0699257
H  3.01985871 -2.43623074 -1.47799467
H  4.71198717 -3.02150254 -1.40615561
H  4.32909446 -1.47513507 -2.22195227
C  -1.6046258 -1.73144439 1.72183753
C  -2.27896657 -2.64867047 0.8479867
C  -0.21591841 -1.75501967 1.36954229
H  -2.05673449 -1.15575164 2.52544027
C  -1.30827813 -3.23313989 -0.02319561
H  -3.343972 -2.86889489 0.84951509
C  -0.03643284 -2.66923754 0.28776871
H  0.58884825 -1.18865327 1.82203806
H  -1.50960157 -3.95545579 -0.81019394
H  0.90758019 -2.85490677 -0.21365775
C  -2.41574409 -1.45439225 -2.27718122
C  -2.83707473 -0.19147441 -1.8039266
C  -3.44394909 -0.11160206 -0.52616023
C  -3.86653531 1.19202729 0.09425456
H  -0.25213548 -0.79311325 -1.49973643
H  -1.83116781 -1.50744508 -3.19598547
H  -3.00914049 -2.33987428 -2.03785567
H  -2.51607921 0.70873449 -2.32094397
H  -4.0491371 -0.97129887 -0.22503106
H  -3.21475551 2.02203707 -0.20731949
H  -4.89786633 1.43979146 -0.21755717
H  -3.86843398 1.12995239 1.19396397
