program: Gaussian 09
title: juf25b
version: ES64L-G09RevD.01
method: RB3LYP
basis: GenECP
operation: Freq
keyword: #T
keyword: Geom=AllCheck
keyword: Guess=TCheck
keyword: SCRF=Check
keyword: GenChk
keyword: RB3LYP/GenECP
keyword: Freq
hfenergy: -1446.0486628 hartree
pointgroup: C01 [X(C23H40N2P1Ru1)]
dipole: 2.2687958 1.0368488 0.165375 debye
polarizability: 349.433431|0.1865808|316.0743579|-10.2439362|23.0266759|292.8355168 unknown
InChI: InChI=1S/C14H28N2P.C5H5.C4H7.Ru/c1-10(2)17(11(3)4)13-15-12(9-16(13)8)14(5,6)7;1-2-4-5-3-1;1-3-4-2;/h9-11,15H,1-8H3;1-5H;3-4H,1H2,2H3;
charge 1 multiplicity 1
67 atoms
Ru -1.66465524 -0.31187085 -0.51403415
P  -0.33536437 1.16746742 0.60254613
C  1.44419882 0.9900948 0.02512125
N  2.52081412 1.78991648 -0.14689308
C  3.61981229 1.01220783 -0.49451964
C  3.21826967 -0.29585326 -0.53608726
N  1.87995994 -0.25943976 -0.20887132
C  2.59674815 3.24667613 -0.00404089
H  2.41216439 3.53202564 1.04026788
H  1.8611439 3.7274496 -0.66096582
H  3.60726772 3.56025124 -0.29497893
H  4.58783151 1.45977235 -0.69027156
C  0.00993599 0.97146316 2.45530606
C  0.89204792 2.06638228 3.06331681
C  0.59362303 -0.41883698 2.73748393
C  -0.62436933 3.01561515 0.42363467
C  -0.82223413 3.35492046 -1.05677085
C  -1.81800309 3.46557112 1.28059433
H  -1.00070431 1.02597479 2.89497037
H  0.26131354 3.53429417 0.81276939
H  1.89720377 2.05069334 2.60598046
H  1.025172 1.88249721 4.14268193
H  0.46365205 3.07268047 2.94428703
H  1.65713666 -0.45826125 2.44589502
H  0.53684501 -0.63896853 3.8159615
H  0.04497264 -1.20296958 2.19369312
H  -1.68850259 2.80525528 -1.45800954
H  -0.99137654 4.43764264 -1.18146191
H  0.05309459 3.06764482 -1.66598443
H  -1.67510421 3.22464943 2.34565912
H  -1.92915114 4.55932658 1.19499689
H  -2.75944141 3.00981145 0.94712197
C  3.93429596 -1.57102308 -0.89395508
C  5.44678853 -1.3106843 -0.93292952
C  3.61059875 -2.64937046 0.15836727
C  3.44748255 -2.03637119 -2.28346688
H  5.97206583 -2.24004161 -1.20137507
H  5.69842109 -0.54980925 -1.69029177
H  5.8176661 -0.97328294 0.04864067
H  3.93599392 -2.33576437 1.16356359
H  4.13131798 -3.58364281 -0.10286554
H  2.52943168 -2.87104897 0.19350242
H  2.35908655 -2.21073271 -2.29261832
H  3.94781668 -2.98117334 -2.54991272
H  3.68580606 -1.28531945 -3.05382718
C  -1.69397559 -0.39783226 -2.74069308
C  -0.371653 -0.6816679 -2.29522276
C  -2.5511732 -1.44200582 -2.23946968
H  -1.99531217 0.44265724 -3.3596097
C  -0.39635505 -1.91724388 -1.53889753
H  0.5126311 -0.09523357 -2.53217482
C  -1.7484884 -2.36383446 -1.50999671
H  -3.62475884 -1.51787421 -2.39111953
H  0.45388649 -2.49814141 -1.18653647
H  -2.10811239 -3.25309809 -0.99778801
C  -3.54819716 0.80017396 -0.34874556
C  -3.21378375 0.26896822 0.92859727
C  -3.00161027 -1.11552502 1.10953732
C  -2.58186245 -1.6765348 2.44429341
H  1.22629426 -1.04185983 -0.15612305
H  -3.58511247 1.88320785 -0.47238538
H  -4.25385757 0.25288094 -0.97870119
H  -2.91432844 0.94644433 1.73361253
H  -3.61169194 -1.79168902 0.50077194
H  -2.04731863 -0.92550181 3.04577863
H  -3.46567456 -2.00494094 3.02244528
H  -1.9232608 -2.55299699 2.32971176
