program: Gaussian 09
title: juf11
version: ES64L-G09RevD.01
method: RB3LYP
basis: GenECP
operation: Freq
keyword: #T
keyword: Geom=AllCheck
keyword: Guess=TCheck
keyword: SCRF=Check
keyword: GenChk
keyword: RB3LYP/GenECP
keyword: Freq
hfenergy: -1446.0403092 hartree
pointgroup: C01 [X(C23H40N2P1Ru1)]
dipole: -0.7691741 1.0899367 0.1427742 debye
polarizability: 327.0129975|-2.1458582|326.7206894|4.3643192|3.8761814|295.9462775 unknown
InChI: InChI=1S/C14H27N2P.C5H5.C4H8.Ru/c1-10(2)17(11(3)4)13-15-12(9-16(13)8)14(5,6)7;1-2-4-5-3-1;1-3-4-2;/h9-11H,1-8H3;1-5H;3H,1,4H2,2H3;
charge 1 multiplicity 1
67 atoms
Ru -1.98688051 -0.42697032 -0.68897697
P  -0.68758805 1.30668965 0.35791974
C  1.00477948 0.7434853 -0.0334476
N  2.22009945 1.37877599 -0.04378766
C  3.16536791 0.4157852 -0.3319031
C  2.49017091 -0.78138044 -0.4689042
N  1.14901936 -0.55633132 -0.28351399
C  2.50455166 2.7992186 0.10936313
H  1.87118589 3.22695672 0.89584677
H  2.3268061 3.34273191 -0.83223623
H  3.55671959 2.91864139 0.40146118
H  4.21794201 0.66821209 -0.41754044
C  -0.70355257 1.51543397 2.24037208
C  -0.3066268 2.8908744 2.78971474
C  0.17386507 0.42424514 2.87060728
C  -0.85874631 3.05613265 -0.28538715
C  -0.4281505 3.23244381 -1.74689151
C  -2.29172169 3.55144542 -0.04626567
H  -1.76014189 1.33798346 2.50747814
H  -0.17843427 3.65191009 0.34124681
H  0.75111595 3.11735587 2.57957236
H  -0.41969929 2.87890633 3.88679432
H  -0.92838323 3.70868124 2.39794153
H  1.23892811 0.66812795 2.72472141
H  -0.02352592 0.36022333 3.95323
H  0.00720876 -0.56242949 2.4188816
H  -1.18875622 2.85289702 -2.44225835
H  -0.29870198 4.30678155 -1.95829502
H  0.52333767 2.72210756 -1.96565644
H  -2.57668593 3.49311628 1.01646709
H  -2.38243635 4.60302742 -0.36497251
H  -3.01496986 2.95131016 -0.62085989
C  3.02122033 -2.16727332 -0.74593537
C  4.53381174 -2.11693738 -0.99926338
C  2.72612258 -3.06316388 0.47400727
C  2.30382532 -2.74733904 -1.9799692
H  4.91625688 -3.13096429 -1.19624193
H  4.76830358 -1.484919 -1.87217531
H  5.06804898 -1.71576459 -0.12170783
H  3.24122026 -2.68356889 1.37207316
H  3.07334066 -4.09189279 0.2806917
H  1.64317469 -3.08936573 0.67955378
H  1.21770285 -2.79940686 -1.79737852
H  2.67176719 -3.7657123 -2.18683887
H  2.48311264 -2.12239442 -2.87100538
C  -2.70338392 0.68224945 -2.39995439
C  -1.37729986 0.19462109 -2.69990748
C  -3.55817185 -0.45952592 -2.21895482
H  -3.02582972 1.71823304 -2.3847656
C  -1.42284286 -1.22528535 -2.62906062
H  -0.49482297 0.79104615 -2.90246863
C  -2.77601807 -1.64422137 -2.35719978
H  -4.61806068 -0.41461625 -1.98105632
H  -0.55844363 -1.88077705 -2.71850937
H  -3.12586211 -2.66926502 -2.2655781
C  -3.70483764 -1.00337847 0.70762185
C  -2.48862628 -1.26726789 1.30831276
C  -1.64307881 -2.46835138 0.95866414
C  -1.02395903 -3.1805552 2.17202761
H  -0.78515569 -2.1305343 0.30564775
H  -4.30969447 -0.1587073 1.04499168
H  -4.21509078 -1.77481773 0.12729493
H  -2.15565971 -0.65505494 2.14541033
H  -2.23582563 -3.17424625 0.35843161
H  -0.39632523 -2.50205965 2.76875852
H  -1.82043546 -3.57478227 2.8239848
H  -0.39457967 -4.02038922 1.83977973
