program: Gaussian 16
title: [B12I11-C2H6S](1-); B-S-CH3
version: ES64L-G16RevC.02
frameworkgroup: C1[X(CH3B12I11S)]
method: UB3LYP
basis: def2TZVPP
operation: Freq
keyword: #P
keyword: Geom=AllCheck
keyword: Guess=TCheck
keyword: SCRF=Check
keyword: GenChk
keyword: UB3LYP/def2TZVPP
keyword: Freq
converged: YES YES YES YES
polarizability: 6.58983713e+02 5.40566292e+00 6.47361637e+02 1.24736676e+01 1.55939692e+00 7.20662094e+02
1716.lowfreq: -1.1113 -0.0006 -0.0006 -0.0006 0.3322 0.8003 7.8833 50.7559 51.0810
frequency: 7.8716 50.7559 51.0810 53.6379 55.4208 57.2935 59.0553 62.1409 62.7585 65.0561 66.4962 68.7969 69.4307 69.8962 70.5410 73.1646 74.2947 77.2445 77.5756 79.9766 101.7088 121.9136 140.3554 141.6270 143.7019 144.1083 144.1491 148.1319 150.3403 150.7826 189.8727 199.5368 257.2787 363.2659 369.0588 372.4219 380.9729 390.0063 421.7387 555.8221 559.0846 559.3351 562.9032 568.0014 647.8524 649.1730 653.3706 657.7807 672.9871 711.1919 712.6627 718.0932 719.7722 721.5904 768.5646 772.8800 777.3621 779.0466 832.2420 835.7225 848.1642 895.4068 897.2279 898.4073 902.3523 910.5378 923.2515 927.8463 937.1760 939.6746 956.0716 1002.4965 1344.0736 1458.8933 1460.7279 3051.9856 3141.8264 3145.2212
redmass: 3.9904 75.7806 100.5247 36.8452 87.8584 91.3583 102.5965 23.0379 89.1709 82.9840 91.3910 74.1269 125.5001 98.1404 89.5550 103.2228 59.7214 49.3784 58.7294 61.1911 15.0846 9.7431 95.4358 83.5303 104.7037 95.7260 93.6255 111.8873 110.7320 114.3007 1.0472 3.8402 8.9737 11.1801 11.2345 11.7239 12.5780 10.9847 11.4576 11.0126 11.0150 11.0142 11.0024 10.4779 11.1487 11.1366 11.1452 11.1444 10.2258 8.5777 8.8734 11.0097 11.0001 10.4189 10.9740 10.6876 10.9882 10.7662 10.8963 11.0663 10.3419 9.6514 10.7810 8.8144 10.8947 10.5138 10.9934 1.3579 8.8466 5.6766 5.2830 1.5449 1.1492 1.0503 1.0499 1.0282 1.1050 1.1051
irintensity: 0.0488 0.3105 0.2382 0.0087 0.0505 0.1391 0.2542 0.3276 0.0957 0.0272 0.6774 0.4007 0.0270 0.3192 0.5482 0.2640 0.1760 13.3694 4.6344 3.4737 6.2830 12.2802 0.1023 0.1681 0.0618 0.2677 0.4205 0.0210 0.0072 0.0480 0.1961 1.5417 7.1450 0.0009 0.0081 0.6108 0.3951 0.4491 0.6692 1.9627 0.0027 0.0571 0.1438 0.0209 0.2924 3.1134 1.0949 0.0499 8.0389 8.1120 9.5335 0.0117 0.2695 1.9096 0.2661 0.1489 0.4572 1.0585 0.2828 12.0272 58.9392 0.9595 9.9092 7.3674 0.7261 70.4678 5.8702 0.2752 23.5991 39.6839 32.6456 26.9912 74.1116 9.6794 10.7302 2.3190 38.3801 11.5413
temp: 298.150 k
press: 1.00000 atm
elementType: 5 5 5 5 5 5 5 5 5 5 5 5 53 53 53 53 53 53 53 53 53 53 53 6 1 1 1 16
symmnumber: 1
zpe: 267127.6 jmol-1
zpe.correction: 0.101744 hartree
zpe.thermalcorrener: 0.134182 hartree
zpe.thermalcorrenthalpy: 0.135127 hartree
zpe.thermalcorrgfe: 0.026294 hartree
zpe.sumelectzpe: -4013.052225 hartree
zpe.sumelectthermal: -4013.019786 hartree
zpe.sumelectthermalent: -4013.018842 hartree
zpe.sumelectthermalfe: -4013.127674 hartree
dipole: 0.2768 -0.0148 -3.2155
dipole: 3.2274
quadrupole: -420.1843 -419.2245 -401.9231
quadrupole: 0.2213 -4.4395 0.2750
quadrupole: -6.4070 -5.4472 11.8542 0.2213 -4.4395 0.2750
hfenergy: -4013.1539687 hartree
pointgroup: C01 [X(C1H3B12I11S1)]
dipole: -0.0884795 1.2651421 -0.0624935 debye
polarizability: 645.1555985|-0.0346228|719.9667201|-0.9709918|14.0238331|661.8851259 unknown
InChI: InChI=1S/CH3B12I11S/c1-25-13-8(20)3(15)2(14)4(3,8,16)6(2,18)7(2,19)5(2,3,17)9(3,8,13,21)11(5,7,13,23)12(6,7,13,24)10(4,6,8,13)22/h1H3
charge -1 multiplicity 2
28 atoms
B  -0.49850292 0.82791226 1.39273086
B  -1.17153659 -0.72199939 0.87834926
B  -1.18263034 -0.74897766 -0.89847594
B  1.17674243 0.89777072 -0.93731034
B  1.18249853 0.9141746 0.8385207
B  1.55551799 -0.58277993 -0.02272948
B  0.09951795 -1.60294951 0.00091911
B  -1.55007866 0.76001493 -0.03689855
B  -0.09094798 1.77005132 -0.05426662
B  -0.51324871 0.798502 -1.4819961
B  0.51072951 -0.66266985 -1.45739448
B  0.52045242 -0.61938758 1.42697882
I  -3.51385121 1.69079054 -0.03554096
I  -1.13891545 1.85410399 3.20128392
I  -2.67538425 -1.72137774 2.06857579
I  -2.70293084 -1.82427737 -2.00570713
I  1.18139651 -1.49469128 3.29671206
I  0.22339851 -3.7694765 0.03823046
I  3.55622506 -1.40320579 0.00496099
I  1.17013735 -1.62282494 -3.28392609
I  2.65338356 2.01688671 -2.07295271
I  -1.18229857 1.60911319 -3.38974749
I  2.68104769 2.03840793 1.94446622
C  -0.69889707 4.40850941 -1.25936324
H  -0.70949464 5.47517738 -1.04656879
H  -1.70172107 4.05689749 -1.48324432
H  -0.04409087 4.19672598 -2.09975597
S  -0.07319837 3.60849208 0.23476902
