program: Gaussian 16
title: [B12I8-SCN](1-) 1,2,3-S; 4-CN
version: ES64L-G16RevC.01
frameworkgroup: CS[SG(CB4I2NS),X(B8I6)]
method: RB3LYP
basis: def2TZVPP
operation: Freq
keyword: #P
keyword: Geom=AllCheck
keyword: Guess=TCheck
keyword: SCRF=Check
keyword: GenChk
keyword: RB3LYP/def2TZVPP
keyword: Freq
converged: YES YES NO NO
title: Mulliken charges:
elementType: B B B B B B B B B B B B I I I I I I I I S C N
charge: 0.074268 -0.057002 0.129470 -0.037962 -0.133514 0.235722 -0.183579 -0.057002 0.074268 -0.133514 0.027173 0.235722 -0.074162 -0.105599 -0.072967 -0.066485 -0.063985 -0.066485 -0.105599 -0.072967 -0.244528 -0.272428 -0.028843
chargesum: -1.00000
title: Mulliken charges with hydrogens summed into heavy atoms:
polarizability: 4.42538132e+02 -4.42773502e+00 4.00112796e+02 1.52503251e-08 -9.97843562e-09 4.59727705e+02
1716.lowfreq: -0.8744 -0.0009 -0.0004 0.0006 0.8353 1.9769 48.0869 49.3846 52.6054
frequency: 48.0869 49.3846 52.6054 54.7462 57.2737 60.6927 62.5157 66.0609 66.3475 67.6728 71.0460 71.4730 78.8537 84.6641 87.4027 137.6652 139.9592 145.2258 147.2904 148.7147 152.6275 154.7623 238.6389 272.6020 287.9121 341.7625 351.5251 385.0056 418.7447 460.7785 463.3874 481.0187 538.8908 544.6098 560.0013 567.3899 568.8416 589.9238 594.8079 652.3063 658.3671 663.7933 691.4912 700.0691 718.8521 723.1901 768.7564 772.0423 781.8266 816.9979 825.5542 826.8680 867.2650 890.3638 894.0656 908.6056 937.2395 956.8889 964.5537 972.0053 1075.6447 1116.3263 2336.3568
redmass: 121.9831 116.8196 123.8548 124.9228 123.2366 126.1865 60.8782 124.4919 110.2874 96.2775 48.3100 67.5611 31.9272 24.4029 15.5050 49.8861 52.2912 81.8259 105.2563 103.9246 50.0477 45.7320 18.3467 15.5649 11.8507 12.8011 12.4664 11.8549 12.5221 12.1937 11.8120 14.8489 11.0510 11.0704 11.2199 11.1255 11.1550 11.1217 11.1345 11.1008 11.1456 11.1340 11.0118 11.3896 11.0312 11.0354 11.0218 11.0720 11.0855 11.0849 11.0647 11.0948 11.0972 11.0441 11.0491 11.0678 11.0785 11.0620 11.0483 11.0261 11.1837 11.2284 12.7139
irintensity: 0.0025 0.0048 0.0025 0.0011 0.0027 0.0044 0.3387 0.0085 0.0086 0.0693 0.6277 0.2951 1.1562 1.2303 2.6669 0.4201 0.3760 0.0608 0.0180 0.0272 0.2569 0.2840 0.5953 0.7043 2.9161 1.3188 7.6646 1.2663 5.0252 6.3865 2.4842 17.4355 1.7936 3.0690 1.3958 0.2347 6.8623 18.5193 17.3209 0.5526 0.7153 0.7671 0.2489 1.4491 4.2083 4.0240 1.3187 50.8416 33.9236 1.6884 8.2056 15.5477 49.8456 22.5370 29.9505 55.1197 74.4515 215.1845 70.7371 0.0298 1.4710 42.0339 0.3744
temp: 298.150 k
press: 1.00000 atm
elementType: 5 5 5 5 5 5 5 5 5 5 5 5 53 53 53 53 53 53 53 53 16 6 7
symmnumber: 1
zpe: 186559.7 jmol-1
zpe.correction: 0.071057 hartree
zpe.thermalcorrener: 0.096985 hartree
zpe.thermalcorrenthalpy: 0.097930 hartree
zpe.thermalcorrgfe: 0.007782 hartree
zpe.sumelectzpe: -3172.455176 hartree
zpe.sumelectthermal: -3172.429248 hartree
zpe.sumelectthermalent: -3172.428303 hartree
zpe.sumelectthermalfe: -3172.518451 hartree
dipole: 3.6761 -0.7289 -0.0000
dipole: 3.7477
quadrupole: -355.2619 -330.2825 -342.8226
quadrupole: 16.0872 0.0000 -0.0000
quadrupole: -12.4729 12.5065 -0.0336 16.0872 0.0000 -0.0000
hfenergy: -3172.526233 hartree
pointgroup: CS [SG(C1B4I2N1S1),X(B8I6)]
dipole: 1.446608 -0.285247 0. debye
dipolederiv: 0.2910246 -0.0252036 -0.5155004 0.0602043 -0.0078476 -0.0939655 -0.5327673 0.0505936 0.7302109 -0.1390731 0.1055671 0.0323245 0.1292266 0.1582593 -0.1433318 0.0693458 -0.0163074 -0.2893593 0.3139394 -0.3108636 0. -0.205221 0.054327 0.0000001 0. 0. -0.0109385 0.4775745 0.364967 0. 0.4544559 0.12914 0. 0. 0. -0.1805157 -0.1910641 -0.0308808 0.0236245 -0.0408837 0.4792612 -0.4133419 0.0252314 -0.3850503 0.0647538 0.1918256 0.0970219 0.4992416 0.0090088 -0.1815432 0.0234192 0.5185663 0.1905034 0.6648382 -0.2937253 0.1658676 0. 0.0127939 0.1681509 0. 0. 0. -0.1762834 -0.1390731 0.1055671 -0.0323245 0.1292266 0.1582593 0.1433318 -0.0693458 0.0163074 -0.2893593 0.2910246 -0.0252036 0.5155004 0.0602043 -0.0078476 0.0939655 0.5327673 -0.0505935 0.730211 -0.1910641 -0.0308808 -0.0236245 -0.0408837 0.4792612 0.4133419 -0.0252314 0.3850503 0.0647538 0.7980791 -0.4063687 0. -0.5238929 0.2402973 0. 0. 0. -0.0635749 0.1918256 0.0970219 -0.4992416 0.0090088 -0.1815431 -0.0234191 -0.5185663 -0.1905035 0.6648382 -0.5756684 0.2172294 0. 0.2422066 -0.1746766 0. 0. 0. -0.0581409 -0.2617049 -0.0512301 -0.285455 -0.0478737 -0.1034101 -0.0672151 -0.2753833 -0.0700387 -0.5189939 -0.0627531 0.0208018 -0.0172134 0.0241892 -0.4190749 0.2491247 -0.0185619 0.2287114 -0.2270733 -0.2317336 0.0155429 0.2961789 0.0030875 -0.0688091 -0.014783 0.2903912 -0.0362677 -0.525134 -0.4496381 -0.2270161 0. -0.2587832 -0.2065533 0. 0. 0. -0.0621834 -0.2317336 0.0155429 -0.2961789 0.0030875 -0.0688091 0.014783 -0.2903912 0.0362677 -0.525134 -0.2617049 -0.0512301 0.285455 -0.0478737 -0.1034101 0.0672151 0.2753833 0.0700387 -0.5189939 -0.0627531 0.0208018 0.0172134 0.0241892 -0.4190749 -0.2491247 0.0185619 -0.2287114 -0.2270733 -0.0385468 -0.1982198 0. -0.1430686 -0.5642658 0. 0. 0. 0.018011 -0.1062196 0.0708773 0. 0.0708327 -0.0326282 0. 0. 0. -0.0021783 -0.3188378 0.0602885 0. 0.0767585 -0.3274624 0. 0. 0. -0.2626807 unknown
polarizability: 442.5473944|-4.3831274|400.1035336|0.|0.|459.7277046 unknown
InChI: InChI=1S/CB12I8NS/c14-3-2(1-22)4(3,15)6(3,17)7(3,18)5(2,3,16)10(7,21)8(6,7,19)9(4,6,20)11(2,4)12(2,5,10)13(8,9,10,11)23(11)12
charge -1 multiplicity 1
23 atoms
B  -0.93069625 0.86813512 1.49553377
B  -0.09830097 2.23557232 0.83546114
B  -1.53066194 1.7107267 0.0000
B  -1.41226934 -0.04121041 0.0000
B  0.08444408 -0.51270295 0.90978402
B  0.88302251 0.95287225 1.46190808
B  1.27514786 1.79692801 0.0000
B  -0.09830097 2.23557232 -0.83546114
B  -0.93069625 0.86813512 -1.49553377
B  0.08444408 -0.51270295 -0.90978402
B  1.53238169 0.08473086 0.0000
B  0.88302251 0.95287225 -1.46190808
I  3.44164937 -0.91610837 0.0000
I  2.05670609 1.21114211 3.26829378
I  0.18319895 -2.35055028 2.04436176
I  -2.07999874 0.84534846 3.31965438
I  -3.19075034 -1.2713725 0.0000
I  -2.07999874 0.84534846 -3.31965438
I  2.05670609 1.21114211 -3.26829378
I  0.18319895 -2.35055028 -2.04436176
S  0.86929734 3.67467485 0.0000
C  -2.82862601 2.52916878 0.0000
N  -3.77663867 3.18257884 0.0000
