program: Gaussian 16
title: [B12I8-SCN](1-) 1-SCN(e5); 2,4,5-X
version: ES64L-G16RevC.02
frameworkgroup: CS[SG(CB4I2NS),X(B8I6)]
method: RB3LYP
basis: def2TZVPP
operation: Freq
keyword: #P
keyword: Geom=AllCheck
keyword: Guess=TCheck
keyword: SCRF=Check
keyword: GenChk
keyword: RB3LYP/def2TZVPP
keyword: Freq
converged: YES YES YES YES
title: Mulliken charges:
elementType: B B B B B B B B B B B B I I I I I I I I S C N
charge: 0.040931 -0.516796 0.040931 -0.169388 0.029118 0.294776 0.444051 0.294776 0.029118 0.270238 -0.460812 -0.460812 -0.065384 -0.082700 -0.053163 -0.072244 -0.053163 -0.082700 -0.065384 -0.092133 -0.109604 -0.138651 -0.021003
chargesum: -1.00000
title: Mulliken charges with hydrogens summed into heavy atoms:
polarizability: 4.78524648e+02 6.19589521e+00 4.06928897e+02 -1.69468265e-08 -8.81361642e-08 4.80815964e+02
1716.lowfreq: -1.0320 0.0008 0.0009 0.0012 0.8686 1.8350 39.2819 42.3818 44.7926
frequency: 39.2819 42.3818 44.7926 46.4030 49.5042 54.2917 56.4307 58.2857 59.3082 62.7221 65.9211 70.2854 70.9293 72.7948 80.0479 111.6033 116.5758 140.3183 144.9345 146.2114 148.1734 148.4686 229.1994 288.6022 302.2796 318.6725 323.4145 343.8366 358.1644 410.2506 448.9488 497.9751 503.1223 518.7699 527.2606 540.4475 548.6422 550.1608 592.2195 627.1745 642.5496 676.1328 683.2624 698.0396 702.4918 711.0781 733.3868 752.5608 766.2337 774.3318 840.1942 852.1556 866.8135 870.2930 887.6754 890.2434 916.1221 922.0838 955.5072 971.0240 1044.2140 1091.0011 2262.1610
redmass: 17.5003 18.2447 52.9541 92.0053 106.2270 121.0627 118.5588 94.1727 108.7641 126.2211 122.6888 98.1466 53.9511 75.6796 56.3130 32.1272 20.1374 103.1404 107.4808 112.7611 109.8088 111.4963 22.9561 13.1185 11.2571 11.8658 12.1013 12.1253 13.2973 12.7519 12.2373 11.1267 11.0958 11.0298 11.0310 12.2473 11.0606 11.2711 11.1606 11.1305 11.0594 11.0529 11.0279 11.2625 17.7513 11.0476 11.0363 11.0942 11.0693 11.0271 11.0749 11.0780 11.0323 11.1159 11.0366 11.0667 11.1195 11.0399 11.0266 11.0300 11.0979 11.0119 12.7585
irintensity: 1.2949 2.4080 0.3166 0.2532 0.0456 0.0209 0.0092 0.2024 0.1417 0.0119 0.0009 0.0493 0.7510 0.1153 0.0579 0.5264 3.3331 0.3202 0.0268 0.1275 0.0004 0.0199 4.1742 1.9063 0.1306 2.9406 3.2302 0.7742 2.4465 1.9243 4.9962 56.5092 13.0417 2.7051 0.0383 6.8252 28.0795 55.7876 41.7593 6.2636 20.2716 5.1620 15.7981 10.2865 1.8581 2.5215 20.1553 2.5813 26.1485 12.4244 39.4993 51.7164 14.0000 51.7036 47.2970 52.4507 26.2175 105.4436 88.7514 198.4624 229.1885 15.6993 36.4494
temp: 298.150 k
press: 1.00000 atm
elementType: 5 5 5 5 5 5 5 5 5 5 5 5 53 53 53 53 53 53 53 53 16 6 7
symmnumber: 1
zpe: 181045.0 jmol-1
zpe.correction: 0.068956 hartree
zpe.thermalcorrener: 0.095611 hartree
zpe.thermalcorrenthalpy: 0.096555 hartree
zpe.thermalcorrgfe: 0.003537 hartree
zpe.sumelectzpe: -3172.350798 hartree
zpe.sumelectthermal: -3172.324143 hartree
zpe.sumelectthermalent: -3172.323199 hartree
zpe.sumelectthermalfe: -3172.416218 hartree
dipole: -3.2446 -0.1422 0.0000
dipole: 3.2477
quadrupole: -367.9396 -326.4524 -343.5071
quadrupole: 0.2031 -0.0000 -0.0000
quadrupole: -21.9732 19.5139 2.4593 0.2031 -0.0000 -0.0000
hfenergy: -3172.4197541 hartree
pointgroup: CS [SG(C1B4I2N1S1),X(B8I6)]
dipole: -1.2764991 -0.0561552 0. debye
dipolederiv: -0.1857873 0.1106671 0.0831439 0.2371247 0.5513217 0.3659234 0.1494041 0.366813 -0.022719 -0.3538681 -0.0910031 0. 0.0699495 0.1287605 0. 0. 0. -0.1595841 -0.1857872 0.1106671 -0.0831439 0.2371247 0.5513217 -0.3659234 -0.1494041 -0.366813 -0.022719 0.5386025 -0.5156358 0. -0.5149033 0.2024591 0. 0. 0. -0.1266244 0.2504346 0.0453594 -0.6541801 -0.080169 -0.1416471 0.0461732 -0.5652596 -0.1067117 0.8288082 0.3124673 -0.0860353 0.6481673 -0.0011456 -0.0817249 0.0140517 0.7178313 -0.0959038 0.9753934 0.9882092 -0.6447942 0. -0.6653327 0.2202176 0. 0. 0. -0.1264304 0.3124673 -0.0860353 -0.6481673 -0.0011456 -0.0817249 -0.0140517 -0.7178313 0.0959039 0.9753934 0.2504346 0.0453594 0.6541801 -0.080169 -0.1416471 -0.0461732 0.5652596 0.1067117 0.8288082 0.7361917 0.664885 0. 0.3994763 0.2160245 0. 0. 0. -0.2494081 -0.3232031 0.0686497 -0.0378191 -0.0219506 -0.3249151 0.2823736 -0.174117 -0.1660993 -0.444017 -0.323203 0.0686497 0.037819 -0.0219506 -0.3249151 -0.2823736 0.174117 0.1660993 -0.444017 -0.2702995 0.0390577 -0.3461412 0.047257 -0.062262 0.0526045 -0.3598081 0.0495899 -0.5924182 -0.2357858 0.0054621 0.325808 0.019662 -0.0597614 -0.00023 0.3106388 0.0223724 -0.5837076 -0.0593117 -0.0242326 -0.0128914 -0.0562354 -0.3968834 -0.262071 -0.0382568 -0.222628 -0.191559 -0.480376 0.301136 0. 0.3344057 -0.2438302 0. 0. 0. -0.0517724 -0.0593117 -0.0242326 0.0128914 -0.0562354 -0.3968834 0.262071 0.0382568 0.222628 -0.191559 -0.2357858 0.0054621 -0.325808 0.019662 -0.0597614 0.00023 -0.3106388 -0.0223724 -0.5837076 -0.2702995 0.0390577 0.3461412 0.047257 -0.062262 -0.0526045 0.3598081 -0.0495899 -0.5924182 -0.5822652 -0.3209993 0. -0.2549166 -0.2486908 0. 0. 0. -0.0541879 -0.6165272 0.080198 0. 0.0924904 0.0123864 0. 0. 0. -0.0040946 0.3303591 0.1927368 0. 0.359496 -0.0553978 0. 0. 0. 0.0886912 -0.5373549 0.0156202 0. -0.1097517 -0.2001852 0. 0. 0. -0.2561509 unknown
polarizability: 478.5226629|6.2073534|406.9308819|0.|0.|480.8159637 unknown
InChI: InChI=1S/CB12I8NS/c14-6-2-3(6)5(2,23-1-22)4-7(2,5,15)9(2,6,17)11(4,7,19)12(4,20)8(3,4,5,16)10(3,6,12,18)13(6,9,11,12)21
charge -1 multiplicity 1
23 atoms
B  0.45290944 0.80912445 0.90920503
B  1.68502025 0.02293168 -0.0000
B  0.45290944 0.80912445 -0.90920503
B  -1.04238566 0.40943199 0.0000
B  -0.54597685 -0.5332794 1.48147332
B  1.28589753 -0.69849586 1.50884968
B  1.79158971 -1.6509569 -0.0000
B  1.28589752 -0.69849586 -1.50884968
B  -0.54597685 -0.5332794 -1.48147332
B  -1.11655764 -1.36651215 0.0000
B  0.30072303 -1.88899616 0.79531184
B  0.30072303 -1.88899616 -0.79531184
I  2.48227445 -0.7945922 3.30772576
I  -1.66862055 -0.517078 3.33089395
I  0.75486404 2.65531352 1.99455568
I  -2.77896295 1.68746543 0.0000
I  0.75486404 2.65531352 -1.99455568
I  -1.66862055 -0.517078 -3.33089395
I  2.48227445 -0.7945922 -3.30772576
I  -2.94585785 -2.55743095 0.0000
S  3.25992123 -2.82440852 -0.0000
C  4.50829431 -1.69120958 -0.0000
N  5.38288746 -0.93463072 -0.00000001
