program: Gaussian 16
title: [B12I11H](2-)[H](1+)
version: ES64L-G16RevC.02
frameworkgroup: C1[X(B12H2I11)]
method: RB3LYP
basis: def2TZVPP
operation: Freq
keyword: #P
keyword: Geom=AllCheck
keyword: Guess=TCheck
keyword: SCRF=Check
keyword: GenChk
keyword: RB3LYP/def2TZVPP
keyword: Freq
converged: YES YES YES YES
title: Mulliken charges:
elementType: B B B B B B B B B B B B I I I I I I I I I I I H H
charge: -0.032734 -0.167600 -0.167597 0.181924 0.097973 -0.181880 -0.181879 0.097976 -0.258823 0.140948 -0.145811 0.140958 -0.094998 -0.097137 -0.097133 -0.115730 -0.113455 -0.093959 -0.093960 -0.113456 0.143591 -0.095758 0.143608 0.047079 0.057855
chargesum: -1.00000
title: Mulliken charges with hydrogens summed into heavy atoms:
elementType: B B B B B B B B B B B B I I I I I I I I I I I
charge: -0.032734 -0.167600 -0.167597 0.181924 0.097973 -0.181880 -0.181879 0.097976 -0.211744 0.140948 -0.145811 0.140958 -0.094998 -0.097137 -0.097133 -0.115730 -0.113455 -0.093959 -0.093960 -0.113456 0.143591 -0.095758 0.201462
polarizability: 5.05200892e+02 1.35552571e-04 5.22079942e+02 1.79431997e+00 -9.84106218e-06 4.66027347e+02
1716.lowfreq: 0.0004 0.0004 0.0006 0.6080 0.6986 1.0786 49.6570 51.1728 53.0367
frequency: 49.6570 51.1728 53.0367 55.8159 56.6272 58.1597 58.6432 61.6059 65.1481 65.9003 67.1761 69.2182 69.5471 71.4680 72.8560 78.2199 79.4918 82.3042 127.9827 137.9914 143.5236 143.6034 143.7714 148.2070 150.0826 151.4771 163.5536 327.7795 329.5158 334.3576 357.7444 372.9348 374.3411 461.7738 524.8811 545.7499 548.2233 555.0835 562.5535 564.2854 615.2103 653.3388 654.2418 663.3307 678.9723 703.3837 706.0161 717.0335 721.1712 758.7780 773.6964 778.7914 791.2523 810.3112 843.3196 843.5408 855.3336 869.3318 886.1237 905.7056 909.2242 909.3056 916.9742 922.4611 930.9764 974.4517 990.5957 994.0854 2702.9947
redmass: 115.7684 113.7759 123.5286 121.3059 120.9791 121.9613 125.0505 97.4210 104.4685 124.9408 118.3011 126.6594 126.8010 121.9089 126.1399 72.1258 67.0450 61.6064 93.2240 81.4256 106.7074 108.2051 110.8286 111.0542 113.8812 116.5327 115.3318 7.0995 6.6887 11.3128 6.9013 11.2000 12.1716 1.5553 1.0437 7.7792 8.5282 10.7182 9.4183 9.8413 8.9086 11.0113 10.6461 10.5341 4.7505 6.8802 6.8544 10.9370 11.0098 9.4094 9.7927 10.8826 9.4446 7.7758 5.5297 10.9189 2.0195 2.0672 9.4968 9.4353 5.5808 9.7070 6.3122 3.8569 10.0127 1.8668 1.4745 3.2899 1.0973
irintensity: 0.1175 0.1402 0.1448 0.0349 0.0780 0.3865 0.0348 1.5631 0.2512 0.0159 1.2455 0.0062 0.0052 0.0623 0.0161 0.1189 3.0761 0.6032 0.3997 8.9342 0.0130 0.0003 0.0006 0.0010 0.4149 0.0012 0.0046 0.2669 30.5867 4.2430 106.0635 0.1102 13.3315 1383.0667 0.1505 1.4922 5.1202 3.2493 0.0210 22.5535 12.1266 0.9510 0.5120 0.1213 247.8166 1.6726 6.1406 0.0125 0.0939 4.3204 1.0553 0.1375 1.0529 15.1981 18.8919 0.2997 49.8401 136.6719 6.5412 19.0783 35.1280 14.7463 40.9067 85.0800 117.7782 32.6056 37.9685 225.4312 15.8685
temp: 298.150 k
press: 1.00000 atm
elementType: 5 5 5 5 5 5 5 5 5 5 5 5 53 53 53 53 53 53 53 53 53 53 53 1 1
symmnumber: 1
zpe: 202261.1 jmol-1
zpe.correction: 0.077037 hartree
zpe.thermalcorrener: 0.106032 hartree
zpe.thermalcorrenthalpy: 0.106976 hartree
zpe.thermalcorrgfe: 0.008381 hartree
zpe.sumelectzpe: -3576.078460 hartree
zpe.sumelectthermal: -3576.049465 hartree
zpe.sumelectthermalent: -3576.048521 hartree
zpe.sumelectthermalfe: -3576.147115 hartree
dipole: 6.4008 -0.0001 -3.3855
dipole: 7.2409
quadrupole: -390.4020 -402.0700 -394.8288
quadrupole: -0.0002 -15.0926 0.0002
quadrupole: 5.3649 -6.3030 0.9381 -0.0002 -15.0926 0.0002
hfenergy: -3576.1554968 hartree
pointgroup: C01 [X(B12H2I11)]
dipole: 1.4469535 -1.9806033 -1.4488765 debye
dipolederiv: -0.1636092 -0.0008794 -0.0093501 -0.0009106 -0.1630632 0.0092602 -0.0017703 -0.0011485 0.7015255 -0.1347491 -0.0024424 -0.0045315 0.0029269 0.5374824 0.3493806 -0.0006404 0.3491589 0.0145418 0.4769925 -0.1928406 -0.3298886 -0.1982236 -0.0722696 0.1104506 -0.330887 0.1066993 0.0125693 0.0972143 -0.349043 0.2663644 -0.3487699 0.3241083 -0.3667474 0.1999281 -0.2755351 0.1003852 0.1027065 0.3386348 -0.2686402 0.3266992 0.2690984 -0.3467373 -0.2101577 -0.2601907 0.1229939 0.4731974 0.1883285 0.3063599 0.1811115 -0.0663902 0.0955545 0.2899972 0.0862309 -0.0094432 0.0936142 0.305381 -0.1836317 0.3126108 0.3160347 -0.2601251 -0.169717 -0.2474376 -0.0122997 0.4448139 0.2138768 0.4142932 0.2259862 -0.0766461 0.1496565 0.3140168 0.120491 0.1266163 -0.1062351 0.0167302 -0.0009309 0.016655 -0.1169244 0.0012412 0.0174869 -0.0240477 -0.0848062 0.2206479 -0.3099796 -0.3909587 -0.1462933 0.0221151 0.1660595 -0.2000924 0.1936013 0.130174 0.0893915 -0.2943268 0.1892095 -0.2942083 0.2805676 -0.2602029 0.1600897 -0.2202222 -0.0190353 -0.0917705 -0.0462781 -0.0391446 -0.2104039 0.333252 0.4228116 -0.1243736 0.2502337 0.1314674 -0.0729906 0.0033262 -0.0019943 0.0033245 -0.0751583 0.0048973 -0.0015867 0.0043369 -0.5926362 -0.0729635 -0.0008805 -0.0009156 -0.0000219 -0.5089376 -0.2004201 -0.0003187 -0.2151316 -0.1639704 -0.4697379 0.1270489 0.1902041 0.1261297 -0.1133519 -0.0599608 0.2040202 -0.065038 -0.1627753 -0.2257012 0.2053526 -0.1403955 0.2053682 -0.3592906 0.1933664 -0.1443256 0.1987628 -0.2268406 -0.2283385 -0.1698101 0.1533975 -0.1829404 -0.3647197 0.1799608 0.1509297 0.1858892 -0.2252945 -0.4646491 -0.1064927 -0.1700511 -0.1133654 -0.1125765 -0.0674021 -0.188027 -0.0788228 -0.1719828 -0.2108593 -0.1964019 0.1155967 -0.1895224 -0.3681871 0.1398748 0.1320001 0.1534538 -0.1701656 -0.4531314 -0.1089737 -0.219543 -0.0958114 -0.1376837 -0.0909334 -0.2243908 -0.0868173 -0.2275417 -0.5514913 -0.1754439 0.1760783 -0.3411731 -0.2283246 -0.095418 0.1069404 -0.1476479 0.0254266 -0.217235 0.2127505 -0.1048106 0.2127641 -0.355285 0.1443764 -0.1078503 0.1485493 -0.1795394 -0.4100988 -0.3864387 0.0339932 -0.2207172 -0.3692684 -0.1988594 0.1053892 -0.1497242 0.0250022 -0.0786263 0.0033483 0.0047178 0.0033219 -0.0807078 -0.0062201 0.011151 -0.0150509 -0.1387691 0.9536086 0.7254536 0.0145719 0.7254634 0.4861261 -0.0138639 0.0121882 -0.0105926 -0.0056018 unknown
polarizability: 516.257435|7.9935001|511.1050105|0.0787675|0.1235439|465.945735 unknown
InChI: InChI=1S/B12H2I11/c13-2-1-3(2,14)5(1)6(1,23-24-22-5)4(1,2,15)8(2,17)7(2,3,16)9(3,5,18)11(5,6,20)10(4,6,8,19)12(7,8,9,11)21/h1H
charge -1 multiplicity 1
25 atoms
B  -0.00645506 0.009107 1.41024879
B  -0.00556441 1.53350155 0.47109332
B  -1.45395645 0.47851635 0.46674213
B  -0.90068776 1.24694014 -1.04917968
B  0.87782058 1.24973041 -1.0504111
B  1.44025045 0.48679572 0.47375976
B  -0.90115953 -1.21865867 0.46671925
B  -1.44882503 -0.44497063 -1.05740214
B  -0.01605515 0.03630704 -1.98657044
B  1.3933801 -0.42038882 -1.02741159
B  0.88509412 -1.21104094 0.4762873
B  -0.01743644 -1.44800497 -1.03165006
I  0.00434487 -0.01468249 3.57629792
I  0.00959586 3.47094092 1.43726403
I  -3.30645072 1.05556419 1.42729227
I  -2.02879605 2.79987109 -2.06088406
I  2.05655237 2.75350838 -2.08647463
I  3.32465733 1.04699771 1.38851516
I  -2.01592326 -2.84302028 1.37245331
I  -3.23757113 -1.10268847 -2.1023857
I  3.16021161 -1.16815952 -2.11368779
I  2.0452093 -2.8075057 1.38223923
I  0.15662956 -3.35592141 -2.1227218
H  0.00492674 0.01235071 -3.16358429
H  1.91194161 -2.60905334 -2.37721865
