program: Gaussian 16
title: H_R_uu-scan-C-Ob-ts-disp-f
version: ES64L-G16RevC.01
frameworkgroup: C1[X(C14H12Cl4N2OPd)]
method: RwB97XD
basis: Gen
operation: Freq
keyword: #P
keyword: Geom=AllCheck
keyword: Guess=TCheck
keyword: SCRF=Check
keyword: GenChk
keyword: RwB97XD/ChkBasFreq
converged: YES YES NO YES
title: Mulliken charges:
elementType: C C C C C C C H H H H C C N C H C C H H H N O Pd C H H Cl Cl Cl C H H Cl
charge: 0.281641 0.266816 -0.135923 -0.147004 -0.146172 -0.163268 0.599252 0.191950 0.186957 0.189908 0.213316 0.281974 -0.116192 -0.610764 -0.105059 0.243863 0.086546 -0.129363 0.228209 0.218209 0.226874 -0.941535 -0.434615 1.277796 -0.458225 0.309084 0.313248 0.065596 -0.000025 -0.022099 -0.452199 0.302785 0.312757 0.065661
chargesum: 2.00000
title: Mulliken charges with hydrogens summed into heavy atoms:
elementType: C C C C C C C C C N C C C N O Pd C Cl Cl Cl C Cl
charge: 0.281641 0.266816 0.056027 0.039952 0.043736 0.050049 0.599252 0.281974 0.127671 -0.610764 0.123150 0.304755 0.097512 -0.941535 -0.434615 1.277796 0.164107 0.065596 -0.000025 -0.022099 0.163343 0.065661
polarizability: 3.81040349e+02 3.83955116e+01 4.03818830e+02 2.63008249e+01 2.94100734e+01 1.99097304e+02
1716.lowfreq: -8.8025 -0.0029 -0.0026 -0.0013 19.4369 29.9525 33.3292 48.1057 54.6016
frequency: 31.5054 44.4892 49.2470 58.4979 67.8403 81.2273 97.9747 104.8029 116.7566 128.6485 131.9570 154.5878 167.8325 186.6820 194.0000 213.2698 227.5844 252.1598 298.5171 308.4237 312.1586 324.5923 334.9299 341.2720 381.7284 429.7834 444.4282 511.6996 576.6484 584.0436 595.2244 633.9239 641.9483 655.1265 673.6228 713.9938 724.5273 758.1092 768.2011 780.7504 781.4717 783.4274 815.1993 847.3444 874.8263 916.9288 931.0847 936.2491 940.3296 979.2212 1020.3044 1024.0040 1028.7066 1045.3956 1060.2220 1061.9243 1095.1787 1137.4588 1147.0420 1180.0072 1189.0591 1209.3660 1216.1729 1218.4218 1224.7130 1296.7316 1323.3314 1326.7646 1339.9823 1343.9626 1363.7122 1388.8144 1458.7990 1469.2270 1486.2534 1490.0304 1499.2607 1538.3017 1565.8968 1634.0856 1663.0003 1681.6544 1702.6291 1706.4101 3171.2829 3175.6471 3241.0573 3251.1897 3254.4398 3260.8767 3262.9819 3268.6773 3273.0630 3278.5386 3281.5935 3292.7676
redmass: 10.8304 8.1059 15.0493 14.8512 6.1420 8.8731 10.6356 5.9855 4.6615 5.3483 10.1554 5.4000 5.3333 3.9920 8.4645 6.2921 8.5437 17.8472 10.4087 14.3088 9.0707 14.5786 7.5804 6.0417 5.7370 2.9411 3.8160 3.5834 7.9899 3.8874 7.7710 8.4090 8.4558 7.1436 6.8991 5.1982 6.3212 3.2739 1.5580 2.5088 4.8751 7.2128 1.8249 5.7985 1.4364 7.2261 1.3387 1.3230 1.3494 1.3580 1.3912 7.5082 1.3221 2.0659 6.8343 1.3838 2.0816 1.6571 1.5143 1.1923 1.1219 1.0247 3.1805 1.0486 3.0548 3.1325 1.5202 1.8072 1.1112 1.1103 4.2194 7.2991 1.0755 1.0731 2.7207 2.5871 2.5569 3.1073 5.6460 7.7777 6.7545 7.5929 7.9357 7.7653 1.0545 1.0553 1.0895 1.0933 1.0918 1.0988 1.0966 1.1180 1.0966 1.1182 1.0956 1.0963
irintensity: 0.4802 0.5141 0.5767 2.1312 2.1330 2.2615 2.3035 1.4845 2.2162 1.6119 0.9849 7.5578 1.4486 3.3625 2.1423 0.9847 18.9413 13.6624 4.2820 24.8327 9.7308 4.4287 5.0587 0.7463 4.0854 2.8949 15.1816 4.4718 0.3236 0.0465 3.6009 166.7228 146.0275 1.3145 8.6556 18.2694 2.3478 13.0245 58.9795 50.8695 139.3412 147.6631 26.7068 62.1764 0.4049 10.6639 3.0636 3.2123 1.1976 1.8863 0.4164 1.7941 0.0821 11.7769 18.9843 0.4087 7.4709 33.7483 3.4641 4.4562 4.7624 2.0848 21.7785 1.2495 21.9767 2.0227 14.9736 11.7353 40.4257 54.6634 77.5083 6.7182 5.7413 7.1101 175.7134 57.5403 15.7596 60.4764 82.3741 141.6880 2.8399 22.0432 19.0085 10.5600 10.1722 9.0885 2.1139 3.0497 3.4566 2.4084 8.3892 29.7363 6.3047 29.8442 2.2231 8.4123
temp: 298.150 k
press: 1.00000 atm
elementType: 6 6 6 6 6 6 6 1 1 1 1 6 6 7 6 1 6 6 1 1 1 7 8 46 6 1 1 17 17 17 6 1 1 17
symmnumber: 1
zpe: 640347.5 jmol-1
zpe.correction: 0.243895 hartree
zpe.thermalcorrener: 0.265190 hartree
zpe.thermalcorrenthalpy: 0.266134 hartree
zpe.thermalcorrgfe: 0.191386 hartree
zpe.sumelectzpe: -2693.298294 hartree
zpe.sumelectthermal: -2693.276999 hartree
zpe.sumelectthermalent: -2693.276055 hartree
zpe.sumelectthermalfe: -2693.350803 hartree
dipole: 3.4671 6.7550 0.5698
dipole: 7.6142
quadrupole: -77.3441 -68.6526 -161.0113
quadrupole: 6.3407 6.0883 3.6875
quadrupole: 24.9919 33.6834 -58.6753 6.3407 6.0883 3.6875
hfenergy: -2693.542189 hartree
pointgroup: C01 [X(C14H12Cl4N2O1Pd1)]
dipole: -2.5591248 0.5207576 1.4675155 debye
polarizability: 410.9165797|16.2750676|327.9174574|-73.3516606|55.6998118|245.122446 unknown
InChI: InChI=1S/C12H8N2O.2CH2Cl2.Pd/c1-2-7-11-9(5-1)14-12(15-11)10-6-3-4-8-13-10;2*2-1-3;/h1-8H;2*1H2;/q-2;;;+2
charge 2 multiplicity 1
34 atoms
C  1.8609682 2.30447795 -0.44894988
C  1.66362117 1.06053216 -1.04883626
C  2.69525615 0.46080733 -1.76882272
C  3.89470832 1.1566468 -1.8296687
C  4.0704819 2.40336314 -1.20532939
C  3.04514994 3.01484368 -0.49546431
C  -0.15302337 1.69224765 -0.04498428
H  2.57844516 -0.49282024 -2.2643497
H  4.72279393 0.72339543 -2.37963617
H  5.02919614 2.90386342 -1.2830832
H  3.15668305 3.97807919 -0.0121679
C  -1.52722381 1.66200537 0.40900234
C  -2.16170329 2.66382268 1.11312298
N  -2.1557602 0.51805124 0.03128135
C  -3.50696328 2.48579484 1.43824201
H  -1.61904631 3.55883188 1.39471109
C  -3.44622947 0.35395325 0.33322632
C  -4.15095416 1.32522906 1.0397159
H  -4.03837238 3.25187594 1.99096582
H  -3.93255915 -0.55476747 0.00605164
H  -5.19657012 1.15220334 1.26227849
N  0.34051617 0.7045129 -0.75048617
O  0.68898884 2.67925912 0.17740225
Pd -0.96755324 -0.79956594 -0.95511007
C  0.00348864 -2.66199606 -3.71622819
H  -0.79405406 -3.39556495 -3.62316973
H  0.87961246 -3.05839916 -4.22575026
Cl -0.57760034 -1.21749821 -4.52638255
Cl 0.59422779 -2.3142151 -2.01721117
Cl -2.64676521 -2.53455398 -1.14139899
C  -2.61783956 -3.48088338 0.42809812
H  -2.7929086 -2.7618214 1.22387602
H  -3.43167991 -4.19483147 0.31860271
Cl -1.09593333 -4.31459298 0.67712146
