program: Gaussian 16
title: Title
version: ES64L-G16RevC.01
frameworkgroup: C1[X(C35H38Ce6CuO35)]
method: UM06L
basis: Gen
operation: Freq
keyword: #p
keyword: freq=noraman
keyword: M06L/gen
keyword: integral=grid=ultrafine
keyword: pseudo=read
keyword: scf=(intrep,xqc,maxconventionalcycles=150)
title: #p freq=noraman M06L/gen integral=grid=ultrafine pseudo=read scf=(intr
basis: NPDir=0 NMtPBC= 1 NCelOv= 1 NCel= 1 NClECP= 1 NCelD= 1
basis: NCelK= 1 NCelE2= 1 NClLst= 1 CellRange= 0.0.
basis: One-electron integrals computed using PRISM.
basis: One-electron integral symmetry used in STVInt
converged: YES YES NO NO
polarizability: 1.02157346e+03 -2.01642085e+00 8.46977353e+02 3.34590566e+00 2.37553687e+00 8.23194415e+02
redmass: 12.3675 6.3816 12.8499 10.2830 9.2053 19.2553 4.2512 3.8381 14.2519 3.9346 4.7662 6.5317 8.3737 9.9148 8.4087 9.7536 11.1044 9.2648 8.5379 7.1543 7.5675 11.7213 8.2962 9.8894 9.0677 7.2667 10.7333 7.1758 11.4932 11.4835 19.3488 8.7787 6.9177 14.3001 10.5806 15.1259 12.2104 12.6805 11.6150 13.6074 13.7929 13.2449 13.4976 15.1851 15.2529 16.4631 15.0773 17.8670 15.9146 13.3454 15.5297 9.1244 9.0782 10.6940 10.8286 10.7874 10.7389 10.7661 8.3559 11.9095 11.6792 12.9004 13.2230 6.0702 8.5812 5.1330 3.9639 3.2071 4.2011 3.1899 3.5820 4.2229 4.7472 3.3824 3.1248 4.5093 3.6422 3.1384 7.6822 8.1076 4.6056 8.2945 8.2994 8.4495 8.3185 8.4650 8.9442 9.8806 9.1991 9.1723 9.2830 8.7029 8.8477 8.3933 8.6560 9.0119 9.4504 7.7710 9.6585 9.9235 10.9869 7.8372 9.9247 8.9031 8.8144 7.9806 9.8138 8.9807 7.9909 8.9696 9.9324 5.6993 7.0494 8.0355 8.0442 7.5161 4.8941 4.7537 4.4075 4.0321 4.1371 4.2780 8.4526 8.7341 6.5775 7.1195 1.7988 9.0705 2.5468 2.2084 2.9472 2.9636 2.9816 2.9726 3.6446 1.3926 2.4946 7.1750 2.8798 4.8077 1.4041 6.6331 11.0496 3.5001 1.2820 8.4096 6.7817 7.9046 7.5489 7.3240 6.7998 7.4162 6.7383 5.5742 5.0417 5.9455 5.2146 1.3322 1.2735 1.2296 1.2022 1.1914 1.2003 3.5000 3.3288 3.3426 3.6469 1.2928 1.2637 1.3100 1.3057 1.1920 1.1516 10.8893 9.4895 7.9474 8.9415 8.3554 1.1515 7.1916 7.1533 1.7229 3.8162 6.8597 6.0424 3.5638 1.2686 2.1323 2.9196 2.6881 3.0155 3.2933 3.2332 3.0007 3.3368 1.2593 1.2463 1.2457 1.3061 5.7223 6.6560 6.8340 6.8781 1.3933 1.4091 1.3830 1.4011 1.1367 1.3536 1.3529 1.3487 1.3349 1.2049 1.2042 1.2058 1.2092 1.0454 2.4155 1.7237 1.7239 2.4475 1.7190 2.4440 1.7174 2.4647 1.7226 1.7207 1.7199 1.2287 1.2353 1.2419 1.2437 1.8135 1.9107 2.0876 2.0615 1.7107 1.6621 1.5762 1.5732 1.1118 1.1105 1.1136 1.1116 1.4985 1.4935 1.4968 1.4912 1.1080 1.1107 1.1071 1.1064 1.1140 1.1122 1.1252 9.3943 8.9793 9.9452 9.7331 10.0272 9.3468 9.9781 6.5790 6.2806 6.0255 5.5021 3.2065 3.1404 3.1904 3.1586 2.5031 2.3894 2.5354 2.5498 7.3228 6.9099 6.3097 6.1183 7.8576 8.5037 8.8672 9.5846 10.4871 10.7829 10.3025 6.0576 5.8878 5.9817 5.9182 9.4652 9.5804 1.1399 10.9996 10.9005 1.0874 1.0816 1.0817 1.0817 1.0818 1.0818 1.0818 1.0823 1.0080 1.0080 1.0080 1.0080 1.0884 1.0885 1.0886 1.0884 1.0885 1.0877 1.0886 1.0884 1.0944 1.0935 1.0936 1.0933 1.0942 1.0942 1.0941 1.0939 1.0699 1.0466 1.0818 1.0482 1.0659 1.0666 1.0661 1.0661 1.0660 1.0661 1.0787
temp: 298.150 k
press: 1.00000 atm
elementType: 58 58 58 58 58 58 8 8 8 8 8 8 8 8 8 8 8 8 8 8 8 8 8 8 8 8 8 8 8 8 8 8 8 8 8 8 8 8 6 6 6 6 6 6 6 6 6 6 6 6 6 6 6 6 6 6 6 6 6 6 6 6 6 6 6 6 6 6 6 6 6 6 6 1 1 1 1 1 1 1 1 1 1 1 1 1 1 1 1 1 1 1 1 1 1 1 1 1 1 1 1 1 1 1 1 1 29 8 1 8 1 1 8 1 1
symmnumber: 1
zpe: 1915725.1 jmol-1
zpe.correction: 0.729661 hartree
zpe.thermalcorrener: 0.820948 hartree
zpe.thermalcorrenthalpy: 0.821892 hartree
zpe.thermalcorrgfe: 0.598901 hartree
zpe.sumelectzpe: -7039.308353 hartree
zpe.sumelectthermal: -7039.217067 hartree
zpe.sumelectthermalent: -7039.216122 hartree
zpe.sumelectthermalfe: -7039.439113 hartree
dipole: 1.3552 6.3142 0.4622
dipole: 6.4745
quadrupole: -532.3049 -559.0200 -561.8328
quadrupole: 0.2553 -3.5145 0.7402
quadrupole: 18.7477 -7.9674 -10.7803 0.2553 -3.5145 0.7402
hfenergy: -7040.0380144 hartree
pointgroup: C01 [X(C35H38Ce6Cu1O35)]
dipole: 0.5331958 2.4842045 0.1818573 debye
polarizability: 1021.5734637|-2.0164304|846.9773532|3.3459058|2.3755367|823.1944153 unknown
InChI: InChI=1S/4C7H5O2.7CHO2.6Ce.Cu.3H2O.6HO.4O/c4*8-7(9)6-4-2-1-3-5-6;7*2-1-3;;;;;;;;;;;;;;;;;;;;/h4*1-5H;7*1H;;;;;;;;3*1H2;6*1H;;;;/q11*-2;2*+3;4*+4;+1;;;;;;;;;;;;;/p-1
charge 0 multiplicity 2
115 atoms
Ce -2.927757 -0.520136 -0.087694
Ce 2.412884 -1.407022 -0.167002
Ce 0.058316 0.570144 2.093754
Ce 0.064801 1.196554 -1.715075
Ce -0.598606 -3.160658 1.450908
Ce -0.546778 -2.539273 -2.333247
O  -3.779778 1.38762 -1.321177
O  3.202008 -3.307112 1.130804
O  3.699461 0.153813 -1.534358
O  -4.269406 -2.137831 1.135144
O  -1.961926 1.682311 2.832871
O  2.30128 0.648679 2.974005
O  0.229053 3.439944 -1.041167
O  -0.428548 -2.77678 3.838227
O  -0.092998 -0.577037 4.240765
O  0.447321 2.884177 1.945402
O  -3.734926 0.960215 1.651469
O  3.715683 -0.422779 1.594382
O  -2.895736 -3.695883 2.027548
O  2.367378 1.803626 -2.300636
O  -1.986745 2.390052 -2.234642
O  1.428891 -4.33156 2.089691
O  -1.100118 0.72531 0.132612
O  -1.7852 -1.07336 2.010505
O  0.813937 -1.442515 1.400387
O  1.596952 0.871163 0.23155
O  -1.604945 -2.324826 -0.370485
O  -1.734763 -0.398794 -2.235386
O  -4.222652 -1.697322 -1.784738
O  3.256782 -2.758617 -2.002596
O  0.887919 -3.315373 -0.509011
O  0.859614 -0.904584 -1.700188
O  0.108066 0.792413 -4.1083
O  -1.038405 -5.253236 0.29914
O  -2.817151 -2.863201 -3.118353
O  1.509815 -3.424642 -3.274242
O  -0.297613 -1.403099 -4.46781
O  -1.003961 -4.886854 -1.930973
C  -3.232535 2.298333 -2.013916
C  2.656883 -4.166498 1.870149
C  3.498995 1.223977 -2.168773
C  -4.020574 -3.192677 1.773812
C  -3.206638 1.638169 2.582885
C  3.464425 0.305933 2.602172
C  -0.225966 -1.780657 4.580692
C  -5.696489 5.31806 -3.771043
C  6.832067 3.179698 -3.993531
C  -5.774265 3.938465 5.110558
C  6.754282 1.800073 4.888085
C  -4.100148 3.345109 -2.62214
C  4.664144 1.894549 -2.810427
C  -4.104275 2.441533 3.458168
C  4.613543 0.811617 3.402545
C  -4.318113 5.337872 -3.972293
C  5.535359 3.55319 -4.337972
C  7.048474 2.16126 -3.066207
C  -6.278283 4.314758 -2.99681
C  -6.314961 3.207281 4.053874
C  6.992208 1.014303 3.761102
C  -4.400428 3.923986 5.342957
C  5.447537 2.090727 5.2756
C  -5.483589 3.329413 -2.422831
C  5.967904 1.513647 -2.479958
C  -3.567124 3.178074 4.519376
C  4.379635 1.598708 4.535442
C  -5.483477 2.45969 3.228984
C  5.925972 0.520622 3.019211
C  4.453809 2.915567 -3.744713
C  -3.521859 4.35487 -3.399588
C  -3.952085 -2.481269 -2.729505
C  2.732236 -3.334568 -2.990589
C  -0.032546 -0.229181 -4.831096
C  -1.153917 -5.599198 -0.904533
H  6.110164 0.714948 -1.758665
H  8.06208 1.872942 -2.803034
H  7.679859 3.681112 -4.452582
H  5.369529 4.339316 -5.068783
H  3.435108 3.185322 -4.008108
H  3.353043 1.809748 4.819453
H  5.263405 2.699977 6.155989
H  7.589988 2.184957 5.466384
H  8.011865 0.788484 3.461984
H  6.086925 -0.090979 2.137082
H  -7.353456 4.302955 -2.842177
H  -5.914097 2.538575 -1.816327
H  -6.321165 6.086502 -4.218577
H  -3.866676 6.11985 -4.576211
H  -2.446183 4.348576 -3.544439
H  -5.881506 1.881897 2.400774
H  -7.386427 3.221101 3.875605
H  -6.42684 4.521427 5.754989
H  -3.981522 4.493511 6.167659
H  -2.494735 3.148544 4.684127
H  0.082828 -0.072356 -5.921957
H  -1.409702 -6.662242 -1.083547
H  -4.817358 -2.878037 -3.296878
H  3.43152 -3.831933 -3.691604
H  3.340758 -4.871482 2.383122
H  -4.898618 -3.740353 2.169965
H  -0.168429 -1.990384 5.667238
H  2.355619 1.448708 0.495686
H  -2.285429 -0.188145 -2.997123
H  -2.349931 -1.121888 2.789404
H  1.317497 -4.166885 -0.644518
H  -0.376421 3.376761 2.044174
H  -0.63597 3.847524 -0.928251
Cu 1.510471 3.565506 0.415363
O  3.172904 2.99037 1.131226
H  3.090354 2.879916 2.085236
O  2.890124 4.331274 -1.065505
H  2.704279 3.686866 -1.77388
H  3.623767 3.946976 -0.552287
O  1.383131 5.897583 0.767228
H  2.05315 5.98989 1.45298
H  1.878479 5.983548 -0.059054
