program: Gaussian 16
title: Title Card Required
version: ES64L-G16RevA.03
method: UwB97XD
basis: def2SVP
operation: Freq
keyword: #P
keyword: Geom=AllCheck
keyword: Guess=TCheck
keyword: SCRF=Check
keyword: GenChk
keyword: UwB97XD/def2SVP
keyword: Freq
converged: YES YES NO YES
polarizability: 2.15693527e+02 -3.31884974e-02 1.48740811e+02 6.07182891e+00 2.12316052e-02 1.00106977e+02
1716.lowfreq: -77.8936 -27.0281 -0.0041 0.0022 0.0034 4.8057 13.6997 27.6043 72.9568
frequency: -68.6375 24.3500 72.0470 175.1348 176.2787 199.5281 237.5986 319.9797 326.5784 403.8364 416.7489 453.0720 458.0400 524.8777 560.8199 624.3713 625.5896 630.1740 707.0092 732.6087 771.8006 781.2808 810.7348 850.7568 870.9265 894.7289 941.1414 980.3844 1016.6178 1027.9871 1051.7609 1059.8926 1070.3017 1079.0717 1102.8101 1112.4789 1115.1985 1159.3561 1183.6157 1188.8147 1206.6921 1235.3619 1264.3589 1327.6672 1333.9511 1379.6927 1384.0907 1401.0486 1480.1140 1491.4937 1513.7181 1666.5507 1667.0753 3014.1171 3055.7319 3222.5498 3224.1270 3224.3788 3234.3154 3236.5948 3238.8280 3247.0544 3249.3354
redmass: 2.9515 4.0610 5.3704 5.5537 5.0833 6.0540 4.5444 8.6304 5.6181 3.6924 2.8215 3.9929 7.5608 6.0095 3.2089 6.4435 4.7878 1.9170 2.0447 5.7459 2.3581 1.6008 3.2333 1.2468 1.2466 1.6274 1.5142 1.3387 6.2450 1.3854 2.2034 1.4276 1.7693 1.2107 1.8840 1.4231 1.9160 1.4586 1.0981 1.4510 3.5901 1.9468 3.0529 1.3860 1.8063 1.9365 4.5513 6.1677 1.1372 2.4308 2.2230 5.9629 6.2294 1.0654 1.0658 1.1023 1.1064 1.0891 1.0913 1.0985 1.0951 1.0979 1.1009
irintensity: 1.6048 2.3035 8.9636 3.2507 4.2556 0.0021 19.6787 3.8627 0.8731 7.0267 0.0052 2.3381 0.4896 38.4907 177.4575 0.2131 79.8126 7.0773 45.2664 20.7101 4.3340 17.4601 99.9428 0.3261 0.1632 61.9338 0.0221 0.5345 3.9903 0.1035 1.8679 1.4908 17.3181 8.6491 10.7514 13.4833 128.1481 0.0516 1.1529 96.6080 166.2409 8.7534 22.0668 1.5982 24.8255 180.5229 14.4626 78.2361 15.5066 37.7972 1.8632 89.8272 0.1709 60.5023 57.8395 16.3218 18.3241 0.7408 3.1451 55.9553 0.1606 0.9779 7.5372
temp: 298.150 k
press: 1.00000 atm
elementType: 6 6 6 6 1 1 1 1 1 16 8 8 6 6 6 6 1 6 1 6 1 1 1
symmnumber: 1
zpe: 466765.8 jmol-1
zpe.correction: 0.177782 hartree
zpe.thermalcorrener: 0.188425 hartree
zpe.thermalcorrenthalpy: 0.189369 hartree
zpe.thermalcorrgfe: 0.139660 hartree
zpe.sumelectzpe: -934.437169 hartree
zpe.sumelectthermal: -934.426526 hartree
zpe.sumelectthermalent: -934.425582 hartree
zpe.sumelectthermalfe: -934.475291 hartree
dipole: 5.5467 -0.0060 -7.6597
dipole: 9.4572
quadrupole: -31.5546 -69.9045 -78.4424
quadrupole: -0.0196 -9.7791 0.0077
quadrupole: 28.4125 -9.9373 -18.4752 -0.0196 -9.7791 0.0077
hfenergy: -934.6149509 hartree
pointgroup: C01 [X(C10H10O2S1)]
dipole: 2.1922662 -0.0024657 -3.0366811 debye
dipolederiv: 0.0941456 -0.009676 0.1057485 0.0461627 -0.1568312 -0.0268114 0.3626358 -0.243538 -0.157889 -0.1990174 -0.0000609 -0.1262527 -0.0001762 0.0681846 -0.0001336 -0.4033371 -0.0001184 -0.0857115 0.0943194 0.0099911 0.1056351 -0.0457149 -0.1567122 0.0269648 0.3627924 0.2436428 -0.1583593 -0.0000346 0.0001359 0.1150143 -0.0000871 0.2972575 -0.0001643 -0.1990377 -0.0000764 0.140736 0.1884969 -0.024917 -0.0017341 -0.0472332 0.1877004 -0.0060215 -0.0315492 0.0456766 0.1206993 0.1173615 0.0159089 -0.0265226 0.0333655 0.1243323 0.0452843 -0.0592865 0.1176002 0.1812663 0.1884111 0.0246588 -0.0018319 0.0472564 0.1878305 0.005817 -0.0318255 -0.0459718 0.1206751 0.117288 -0.0159952 -0.0264877 -0.0333969 0.1241786 -0.0451907 -0.0594966 -0.1175395 0.1820418 0.3090432 -0.0000469 -0.0166384 -0.0000672 0.1160263 0.0000846 -0.0171729 0.0000648 0.1963337 2.6504774 -0.0002078 0.0807599 -0.0000815 1.940946 0.0001974 0.1450579 0.000058 2.1741741 -0.8803396 0.1113879 -0.0945929 0.1278982 -0.9640485 0.3783821 -0.0241597 0.2101288 -0.8756451 -0.8801671 -0.1113369 -0.0945638 -0.1279046 -0.9649111 -0.3783612 -0.0242036 -0.2098875 -0.8746646 -1.2009542 0.000134 -0.0217334 -0.0004318 -0.0878984 -0.0000008 -0.1342846 0.000087 -0.3244549 0.281814 -0.2173811 0.0178628 0.5005838 -0.0793619 0.0084137 0.1798441 -0.101736 -0.0221565 0.2820696 0.2173487 0.0179018 -0.5003563 -0.0791971 -0.0084834 0.1795607 0.101536 -0.022221 -0.3505326 0.2916413 0.0020967 0.2783173 -0.0299143 0.0257346 -0.107971 0.1030214 -0.1074446 0.1149216 0.0574005 -0.0120543 0.0340263 0.0928923 0.0008212 -0.0003163 0.0219948 0.1287446 -0.3508166 -0.2915807 0.0020149 -0.2787 -0.0298452 -0.0256013 -0.1083707 -0.1029326 -0.1074848 0.1150444 -0.0573864 -0.0120745 -0.0339217 0.0930232 -0.0008173 -0.0002831 -0.0219975 0.1287284 0.2021366 -0.0000511 0.0853014 0.0004366 0.1784411 0.0000132 0.0891301 0.0000997 -0.0161998 0.0570894 -0.0438452 -0.0240213 -0.0543597 0.0142542 -0.0157363 -0.0370984 -0.0146022 0.1321103 0.0570788 0.0438786 -0.0239799 0.0544021 0.0142554 0.0156282 -0.0370867 0.014513 0.1321182 -0.0078356 -0.0000004 -0.0498479 -0.0000178 0.1093974 -0.0000194 -0.0435414 -0.0000233 0.1146032 unknown
polarizability: 215.6935265|-0.0331885|148.7408114|6.0718289|0.0212316|100.1069774 unknown
InChI: InChI=1S/C10H10O2S/c11-13(12,10-6-8(10)7-10)9-4-2-1-3-5-9/h1-5,8H,6-7H2
charge 1 multiplicity 2
23 atoms
C  2.3875867 -1.13515779 -1.17192133
C  1.56255907 -0.0007572 -0.66558951
C  2.38798408 1.13241701 -1.17398883
C  3.23721312 -0.00112958 -0.74314974
H  2.41397502 -2.07443449 -0.61092995
H  2.30714418 -1.25816929 -2.26821236
H  2.41464683 2.07274127 -0.61475958
H  2.30759462 1.25345975 -2.27052458
H  3.91106063 -0.00047344 0.11964922
S  0.62729154 0.00059704 0.89199974
O  0.9503722 -1.26908443 1.51813012
O  0.95088206 1.2709773 1.51642851
C  -1.01883141 0.00049181 0.28235858
C  -1.64790417 -1.22685809 0.04736476
C  -1.64848691 1.22772119 0.04837128
C  -2.94650034 -1.21504373 -0.44958869
H  -1.13397749 -2.16417528 0.26519781
C  -2.94711516 1.21568668 -0.44850228
H  -1.13497822 2.16508583 0.26696882
C  -3.58917368 0.00027112 -0.69747932
H  -3.4631393 -2.15749871 -0.63644393
H  -3.4642502 2.15804462 -0.63447129
H  -4.60966117 0.00018841 -1.08503344
