program: Gaussian 16
title: Title Card Required
version: ES64L-G16RevA.03
frameworkgroup: C1[X(C8H8F5O2S2)]
method: UwB97XD
basis: def2SVP
operation: Freq
keyword: #P
keyword: Geom=AllCheck
keyword: Guess=TCheck
keyword: SCRF=Check
keyword: GenChk
keyword: UwB97XD/def2SVP
keyword: Freq
converged: YES YES NO YES
polarizability: 1.93291428e+02 6.79260485e+00 1.38277651e+02 -1.94101202e+01 1.75549984e+01 1.11423986e+02
1716.lowfreq: -0.0013 -0.0011 -0.0010 6.9457 12.0187 17.8256 22.5351 30.5523 33.0719
frequency: 21.7338 30.2489 32.9742 42.4399 73.4067 171.9893 189.1132 199.3990 227.1888 285.8793 311.2829 323.8366 339.3345 359.0429 403.9264 418.4215 419.2665 444.9653 462.5153 494.6446 499.3544 534.8418 547.4575 552.4233 583.0722 608.0612 627.4305 629.7777 644.3456 667.8208 715.1811 717.4039 757.7760 788.6473 874.4955 887.7572 893.6344 915.5843 948.1241 969.5836 1017.8987 1024.7103 1052.4077 1055.6595 1107.7803 1114.5905 1118.8012 1176.5557 1177.5420 1194.2316 1197.1477 1253.5514 1324.9944 1331.3455 1360.9371 1377.7838 1443.2037 1489.3782 1520.5712 1675.4213 1675.8839 3125.4460 3214.5949 3217.9444 3224.2232 3230.1657 3237.3274 3240.9090 3241.4158
redmass: 10.6764 6.4211 8.1172 4.7160 8.7739 6.8721 8.9990 7.2625 8.4057 3.2552 3.9623 5.3750 17.4936 5.9973 6.4025 6.2880 2.8822 5.0111 18.0677 6.7546 2.5554 5.0751 14.5802 8.2345 6.2848 9.1080 6.4133 18.7918 5.0424 15.6384 2.0964 4.2351 3.3426 2.0804 1.2462 4.4527 19.4850 20.8317 2.3180 1.3660 6.2093 1.3816 1.4567 2.0605 1.4274 3.2388 1.6075 2.9690 1.2190 1.3158 1.4557 1.2505 1.3946 1.6245 6.7034 6.2945 1.2656 2.4119 2.2877 6.5099 6.1128 1.0589 1.0878 1.1111 1.0908 1.0949 1.0983 1.0910 1.0988
irintensity: 1.1362 0.1442 0.1145 2.0406 0.8137 2.8430 9.2037 0.8524 0.4123 1.1922 9.8895 0.8287 0.0518 17.9822 4.6411 2.0192 0.0147 37.0847 0.0091 23.7211 16.9605 92.8588 23.8243 21.8596 69.7433 124.4671 0.0503 0.3075 45.2631 0.9024 54.1372 0.2218 165.3033 35.8271 0.1585 288.7733 418.1413 457.4942 179.3564 1.9066 2.6903 0.1623 1.5837 2.9444 14.0568 54.8063 10.8455 217.3106 35.4848 18.9536 18.8692 11.9218 19.8617 18.8737 236.9689 5.1429 6.5933 27.2140 1.9435 0.3142 11.5045 3.1927 0.6013 12.9719 6.1399 1.4998 2.6219 11.0056 8.0763
temp: 298.150 k
press: 1.00000 atm
elementType: 6 1 1 6 1 16 8 8 6 6 6 6 1 6 1 6 1 1 1 16 9 9 9 9 9
symmnumber: 1
zpe: 430875.8 jmol-1
zpe.correction: 0.164112 hartree
zpe.thermalcorrener: 0.179805 hartree
zpe.thermalcorrenthalpy: 0.180749 hartree
zpe.thermalcorrgfe: 0.117770 hartree
zpe.sumelectzpe: -1754.037289 hartree
zpe.sumelectthermal: -1754.021596 hartree
zpe.sumelectthermalent: -1754.020651 hartree
zpe.sumelectthermalfe: -1754.083631 hartree
dipole: 6.0073 4.3041 -4.2034
dipole: 8.5018
quadrupole: -96.7310 -109.1221 -113.1988
quadrupole: 3.3660 -6.1174 3.8789
quadrupole: 9.6196 -2.7714 -6.8482 3.3660 -6.1174 3.8789
hfenergy: -1754.2014009 hartree
pointgroup: C01 [X(C8H8F5O2S2)]
dipole: -0.9976355 3.1591843 0.460966 debye
dipolederiv: -0.1404482 0.0281108 -0.0090835 0.2076222 0.3905605 0.0690403 -0.1228075 0.0142378 -0.1202744 0.1613118 0.0443388 -0.0380296 -0.024407 0.0385112 -0.0207437 0.0045359 -0.0131682 0.1038041 0.0466453 -0.0279217 0.0083684 -0.0525633 -0.0037594 -0.0095984 0.0077673 0.0038004 0.1206262 -0.1765423 -0.0213982 -0.0017128 0.0265009 -0.3697955 -0.0925535 -0.0050312 -0.0700855 -0.1438977 0.0107229 -0.0480917 -0.0142951 -0.0543463 0.1235487 0.0255996 0.0252058 0.073374 0.1010275 2.0931877 0.2669132 -0.0394155 0.2130912 2.8549453 0.0979929 0.0451536 0.1136448 2.0000186 -0.7977053 -0.0494854 -0.1364337 0.0008465 -1.1103742 0.1863279 -0.1902882 0.3484215 -1.0276943 -0.9766412 0.0383842 0.2563235 -0.0008638 -0.9699116 -0.1624158 0.2916369 -0.2946819 -1.0003121 -0.3219447 -0.0699362 -0.0342816 -0.0831515 -0.6618624 -0.0613538 -0.0534325 -0.0724989 -0.1336705 -0.0818994 -0.0914076 -0.0046777 0.0269337 0.0031029 -0.1853508 0.0597539 0.2036842 -0.0567604 -0.0484829 0.0047915 -0.0020732 -0.0369023 0.020644 0.2027715 -0.0651147 -0.2118408 -0.0724497 -0.1190274 -0.016286 -0.0068107 -0.0596147 -0.1760998 0.2054273 -0.0159847 0.0925837 0.0435013 0.1241124 -0.0163063 0.0110169 -0.0115799 0.1012589 0.0678884 0.0243953 0.0428779 0.0816871 -0.0991063 0.0436764 -0.0444768 0.0328748 -0.1258292 -0.2402741 -0.0443518 -0.1335741 -0.0449098 0.1288083 -0.0030879 0.0120768 0.0186559 0.1297988 -0.055813 0.0011014 -0.0309807 0.0656379 -0.0776748 0.0137267 -0.0344398 0.0033804 0.1264645 0.007767 -0.0280372 0.0235992 0.0800361 0.1358817 0.009109 0.0278823 -0.0022763 0.0476084 -0.0537711 0.0264146 -0.0618193 -0.0252074 0.1300904 -0.0216139 0.0373918 -0.0308221 0.0186941 0.062113 0.0365938 0.0702597 0.0084953 0.1292095 -0.0183804 0.0043818 -0.0156434 -0.0598426 -0.0203925 0.0044895 -0.0213397 0.1011838 3.448584 0.2074209 0.0333411 0.2680542 3.6344742 -0.0667033 0.0925045 0.0206947 3.2901136 -0.5581453 -0.072471 -0.2157267 -0.0192836 -0.6194439 0.0832328 -0.3331916 -0.1217831 -1.008694 -1.2215671 -0.3844752 0.1642191 -0.2219868 -0.6921351 -0.0068146 0.1644626 0.0100851 -0.4773502 -0.4363334 0.1135603 -0.140367 -0.0764045 -0.9752112 0.2666416 -0.0437116 0.4128969 -0.8444793 -0.8818681 0.1698653 0.1999617 0.0163659 -0.72577 -0.104947 0.1672689 -0.1730144 -0.5129064 -0.4711676 -0.0990357 -0.0331395 -0.1244802 -0.9995764 -0.1940709 -0.0493329 -0.2253734 -0.5275254 unknown
polarizability: 108.9300181|26.1680943|190.080686|-11.1885723|2.4987077|143.9823608 unknown
InChI: InChI=1S/C8H8F5O2S2/c9-17(10,11,12,13)7-6-16(14,15)8-4-2-1-3-5-8/h1-6H,7H2
charge 0 multiplicity 2
25 atoms
C  2.15349914 -0.66805356 -0.44998979
H  2.6269654 -0.83292693 0.52477657
H  1.12940082 -0.29420045 -0.33276519
C  2.95783406 0.21382037 -1.29990361
H  2.57690254 0.66852607 -2.2169957
S  4.67386579 0.44857031 -0.9641497
O  4.95384331 -0.20438475 0.31285516
O  5.41197285 0.08164439 -2.16790802
C  4.80305079 2.20790639 -0.74333829
C  4.58540977 2.74793415 0.52513342
C  5.11821027 3.00698106 -1.84233729
C  4.6755981 4.12771852 0.68845125
H  4.36083578 2.09249126 1.36834871
C  5.20463085 4.38574372 -1.66367554
H  5.30235963 2.54879212 -2.81542164
C  4.98183589 4.94244538 -0.40337329
H  4.51272077 4.56886019 1.67339156
H  5.453222 5.02714404 -2.51105102
H  5.0527833 6.02370091 -0.26890351
S  1.92076554 -2.37320708 -1.15583414
F  1.44510026 -1.76396593 -2.57529264
F  0.38340468 -2.42239071 -0.66507724
F  2.36910722 -3.08307838 0.21921375
F  3.44567063 -2.43156132 -1.67975692
F  1.70946461 -3.83565778 -1.7798929
