program: Gaussian 16
title: Title Card Required
version: ES64L-G16RevA.03
method: RwB97XD
basis: def2SVP
operation: Freq
keyword: #P
keyword: Geom=AllCheck
keyword: Guess=TCheck
keyword: SCRF=Check
keyword: GenChk
keyword: RwB97XD/def2SVP
keyword: Freq
converged: YES YES NO YES
title: Mulliken charges:
elementType: C H H C H S O O C C C C H C H C H H H
charge: -0.013406 0.095585 0.095378 -0.134098 0.093215 0.814768 -0.500303 -0.507870 -0.142029 0.013554 0.004972 -0.031705 0.046437 -0.029247 0.049984 -0.001470 0.048605 0.048616 0.049015
chargesum: 0.00000
title: Mulliken charges with hydrogens summed into heavy atoms:
elementType: C C S O O C C C C C C
charge: 0.177557 -0.040883 0.814768 -0.500303 -0.507870 -0.142029 0.059991 0.054956 0.016900 0.019369 0.047545
polarizability: 9.04591231e+01 2.85113233e+01 1.44980488e+02 -1.07970322e+01 -8.51818665e+00 1.31140435e+02
1716.lowfreq: -14.6951 -0.4736 -0.0024 0.0017 0.0021 13.3870 40.3486 74.3781 126.0481
frequency: 40.3268 74.3662 126.0447 190.8711 247.3499 262.4887 314.1289 351.5687 415.6555 419.6818 488.9168 508.5845 566.0901 628.2024 660.2489 707.0359 718.3634 755.8542 788.7630 874.9661 968.2643 991.4580 1009.1721 1015.8714 1018.4966 1023.6479 1050.8677 1054.5532 1103.1192 1114.9136 1175.8121 1177.5192 1191.2224 1260.8835 1321.7065 1357.1189 1376.1287 1390.2391 1489.7669 1520.3411 1676.9047 1678.0499 1712.5724 3171.1987 3213.0496 3221.8178 3223.9797 3228.3661 3234.7918 3238.3021 3284.4189
redmass: 4.2006 3.9061 3.0255 6.0554 3.4049 3.6668 8.4395 4.7773 4.4168 2.8478 5.0540 4.3038 3.9880 6.4114 2.3525 4.3466 1.8238 4.0805 1.9707 1.2458 1.3627 1.0746 1.3500 1.3580 5.7916 1.3818 1.4845 1.9470 1.4288 3.3072 3.4939 1.1285 1.3750 1.3663 1.3592 10.4799 6.5009 1.1962 2.3974 2.3214 6.4819 6.2518 5.1398 1.0600 1.0874 1.0906 1.1001 1.0945 1.0973 1.1007 1.1190
irintensity: 1.4645 1.9245 2.7608 2.4452 0.3059 0.5020 3.9920 7.4977 14.0606 0.0881 6.4750 40.1640 84.9740 0.1158 89.5060 49.8300 57.0594 209.6113 22.6435 0.2695 0.6301 27.3069 1.5138 29.4720 3.7520 0.2865 2.2596 3.1640 17.0753 51.0557 236.6041 7.0000 34.8052 13.4672 10.6920 257.5930 8.6291 16.5556 27.1441 3.1273 1.6059 4.0146 5.1143 2.3787 0.4668 6.5247 1.5144 1.6326 1.1522 11.5202 2.3001
temp: 298.150 k
press: 1.00000 atm
elementType: 6 1 1 6 1 16 8 8 6 6 6 6 1 6 1 6 1 1 1
symmnumber: 1
zpe: 380616.2 jmol-1
zpe.correction: 0.144969 hartree
zpe.thermalcorrener: 0.154808 hartree
zpe.thermalcorrenthalpy: 0.155752 hartree
zpe.thermalcorrgfe: 0.108851 hartree
zpe.sumelectzpe: -857.448460 hartree
zpe.sumelectthermal: -857.438622 hartree
zpe.sumelectthermalent: -857.437677 hartree
zpe.sumelectthermalfe: -857.484578 hartree
dipole: -3.4113 4.6400 1.1682
dipole: 5.8764
quadrupole: -95.2822 -39.6243 -69.3047
quadrupole: 20.3535 4.9641 0.3318
quadrupole: -27.2118 28.4461 -1.2343 20.3535 4.9641 0.3318
hfenergy: -857.5934292 hartree
pointgroup: C01 [X(C8H8O2S1)]
dipole: -1.3421158 1.8255208 0.4596126 debye
dipolederiv: -0.0843315 -0.0979857 0.0363576 0.045335 -0.0839592 -0.0835855 -0.0858947 -0.1396205 -0.0081602 0.1103749 0.0446488 -0.0568494 -0.0016483 0.117549 0.0205915 -0.011931 0.009341 0.0916233 -0.0119508 -0.0337013 0.0118477 -0.0160237 0.1579145 0.0325778 0.0145615 0.0618892 0.1163978 -0.3458468 -0.0925248 0.1324158 -0.0924496 -0.5704086 -0.0921707 0.0610955 -0.0695105 -0.2427188 -0.0010413 -0.0115083 -0.0043115 -0.005391 0.1500557 0.0608951 0.0102031 0.0782029 0.0738329 2.3772979 0.3754804 -0.2643627 0.1992995 2.8886843 0.126212 0.0130855 0.1539749 2.0806374 -0.9088147 0.0381844 -0.1356334 0.0735825 -1.138008 0.1779589 -0.2487972 0.3338874 -0.9384556 -0.9300344 -0.0490125 0.2496729 -0.0191845 -1.0153555 -0.2068404 0.2692555 -0.3480486 -1.1895072 -0.3840225 -0.0719856 0.0346197 -0.0714867 -0.5556083 -0.0442562 -0.002125 -0.0475396 -0.1460983 -0.0748344 -0.0397751 -0.0246732 -0.010806 -0.0341723 -0.1792981 0.0585644 0.1497238 -0.0717906 -0.0720675 -0.0197498 0.0187335 -0.0235618 -0.0313012 0.1913903 -0.0760549 -0.1636698 -0.0383331 -0.1207153 -0.0030765 0.0353976 -0.0201284 -0.1472509 0.1922775 0.0103346 0.0712678 0.0479237 0.1226315 -0.0145639 0.018122 -0.0066946 0.0981409 0.0717992 0.0209197 0.0458331 0.0717766 -0.1089333 0.0207824 -0.0626796 0.0082459 -0.0913949 -0.2159018 -0.0344161 -0.102947 -0.0239964 0.12723 -0.0047953 -0.0029815 0.011308 0.1367887 -0.0614123 -0.0098225 -0.0313648 0.0553035 -0.0863825 0.0428144 -0.0056439 0.0286463 0.1140028 0.0148406 -0.0047846 0.0120883 0.0651591 0.1364919 -0.0133042 -0.0042771 -0.0211199 0.0483441 -0.0552327 -0.0065315 -0.0648077 -0.0376331 0.1318885 -0.0269669 0.0258016 -0.0359812 0.0176363 0.0699192 0.0252291 0.0725986 -0.0044286 0.1230602 -0.0429603 -0.0015561 -0.0419415 -0.061657 -0.0197646 -0.0028913 -0.0212987 0.0984677 unknown
polarizability: 90.4591231|28.5113233|144.9804882|-10.7970322|-8.5181867|131.1404353 unknown
InChI: InChI=1S/C8H8O2S/c1-2-11(9,10)8-6-4-3-5-7-8/h2-7H,1H2
charge 0 multiplicity 1
19 atoms
C  1.90698258 1.1150349 0.57579959
H  2.45190121 0.64460452 1.39875813
H  0.81764507 1.03446321 0.55738284
C  2.55735326 1.76312775 -0.38340229
H  2.09136 2.25322402 -1.242128
S  4.33315329 1.8313416 -0.37444935
O  4.81442027 1.11584737 0.80620948
O  4.78724464 1.44264634 -1.70811198
C  4.6905808 3.56620562 -0.1565786
C  4.73339364 4.09198275 1.13470246
C  4.92728645 4.35562927 -1.28044043
C  5.00791733 5.44728208 1.29820775
H  4.56288535 3.44290468 1.99550818
C  5.2018356 5.71070278 -1.10294585
H  4.90594073 3.90631395 -2.27468593
C  5.23950537 6.25350913 0.18171706
H  5.04770534 5.87529878 2.30158683
H  5.39263454 6.34319007 -1.9719253
H  5.45646677 7.3152883 0.31574378
