program: Gaussian 16
title: Title Card Required
version: ES64L-G16RevA.03
method: RwB97XD
basis: def2SVP
operation: Freq
keyword: #P
keyword: Geom=AllCheck
keyword: Guess=TCheck
keyword: SCRF=Check
keyword: GenChk
keyword: RwB97XD/def2SVP
keyword: Freq
converged: YES YES YES YES
title: Mulliken charges:
elementType: C C C C H H H H H S O O C C C C H C H C H H H
charge: 0.018167 -0.262581 0.018165 -0.057330 0.077492 0.065541 0.077494 0.065538 0.092837 0.830601 -0.502707 -0.502705 -0.103677 0.004781 0.004779 -0.030474 0.047003 -0.030475 0.047003 -0.002504 0.047539 0.047539 0.047975
chargesum: -0.00000
title: Mulliken charges with hydrogens summed into heavy atoms:
elementType: C C C C S O O C C C C C C
charge: 0.161200 -0.262581 0.161197 0.035507 0.830601 -0.502707 -0.502705 -0.103677 0.051784 0.051782 0.017065 0.017064 0.045471
polarizability: 1.77332946e+02 3.29035436e-03 1.51579762e+02 1.23648474e+01 -1.92711390e-02 1.00798297e+02
1716.lowfreq: -13.7159 -10.3893 -5.1746 0.0018 0.0023 0.0025 30.2908 42.7712 65.8296
frequency: 30.1852 42.7116 65.8292 173.6087 182.5980 207.8301 262.2213 318.3211 344.3889 406.4847 419.5486 466.3539 468.2180 497.9034 571.0951 628.2261 636.2442 718.6600 738.2492 784.3448 824.8856 875.6338 882.0225 886.9819 943.9485 955.5206 969.2396 1018.8326 1023.7670 1026.3737 1050.8483 1056.0565 1090.1677 1098.5799 1107.8096 1114.8383 1138.0240 1163.9337 1174.2256 1178.0094 1192.5495 1196.6938 1322.5032 1326.8775 1350.4718 1365.6717 1375.3713 1468.1382 1490.0688 1515.9881 1522.7055 1678.2448 1678.4023 3112.8390 3117.2012 3213.3021 3223.5979 3230.4227 3233.5886 3235.7394 3238.8868 3241.1212 3264.7144
redmass: 3.8799 3.2714 4.9100 4.4368 5.3875 5.6854 4.2320 8.3750 5.9083 3.1275 2.8505 3.7831 7.1925 2.9736 8.6979 6.4191 5.8277 1.8921 5.2096 1.7580 2.1441 1.2452 3.3056 1.6096 1.2943 1.3898 1.3736 6.2292 1.3864 1.5037 1.3908 2.2043 1.2447 1.7316 1.4326 3.1421 1.3790 1.5887 4.1555 1.1010 1.2566 2.0116 2.2496 1.5548 15.5138 2.4049 6.4413 1.2613 2.3956 1.5482 2.2996 6.1439 6.5416 1.0592 1.0599 1.0877 1.0912 1.0953 1.1161 1.1145 1.0966 1.0997 1.0982
irintensity: 0.3494 0.8692 1.4827 5.8599 3.3539 0.0524 3.1847 6.3819 0.6051 8.3499 0.0032 11.3433 0.4376 12.0785 148.2565 0.0106 146.4202 46.1238 58.8115 15.5948 345.2985 0.2032 13.3749 0.0101 1.2586 16.2586 0.0166 2.0710 0.6224 3.9809 0.9417 3.9218 0.0237 19.4017 14.5565 43.0453 44.2241 2.1239 176.2525 0.2653 0.3285 55.7095 0.0108 21.4125 245.0111 61.1042 1.8597 0.7784 24.9960 16.2987 4.5268 3.9873 0.0190 35.2084 16.1062 0.5311 7.1132 3.8708 5.1397 0.7422 0.7277 9.7142 2.7810
temp: 298.150 k
press: 1.00000 atm
elementType: 6 6 6 6 1 1 1 1 1 16 8 8 6 6 6 6 1 6 1 6 1 1 1
symmnumber: 1
zpe: 473349.3 jmol-1
zpe.correction: 0.180289 hartree
zpe.thermalcorrener: 0.191513 hartree
zpe.thermalcorrenthalpy: 0.192457 hartree
zpe.thermalcorrgfe: 0.141535 hartree
zpe.sumelectzpe: -934.708542 hartree
zpe.sumelectthermal: -934.697318 hartree
zpe.sumelectthermalent: -934.696374 hartree
zpe.sumelectthermalfe: -934.747296 hartree
dipole: -1.7775 -0.0018 -4.6548
dipole: 4.9827
quadrupole: -67.7044 -79.2612 -89.7375
quadrupole: -0.0016 -1.8891 -0.0036
quadrupole: 11.1966 -0.3602 -10.8365 -0.0016 -1.8891 -0.0036
hfenergy: -934.888831 hartree
pointgroup: C01 [X(C10H10O2S1)]
dipole: -0.6993131 -0.0006991 -1.8313493 debye
dipolederiv: 0.1978064 -0.0297831 -0.0338113 -0.1133077 0.0614528 0.1102154 0.062122 0.0629613 0.1779156 -1.2852608 0.0002944 0.2783724 0.0004384 -0.2126845 -0.0001639 0.304134 -0.0001686 -0.4891775 0.1978976 0.0297915 -0.033927 0.1132406 0.0612509 -0.110151 0.0620057 -0.0629622 0.1780323 -0.3130302 0.0001319 -0.0031233 0.0001148 0.1026238 -0.0000407 -0.0101239 -0.0000149 -0.0454449 0.202853 -0.0300121 -0.0172513 -0.0024087 0.0019814 0.0029041 -0.0207187 0.054382 0.044399 0.0311152 0.0058677 0.0179805 0.0413364 0.0211778 -0.0071737 0.0339972 -0.0878013 -0.1253203 0.2028744 0.0298818 -0.0172652 0.0022273 0.0019102 -0.0028868 -0.0207485 -0.0543233 0.0444281 0.0310962 -0.0058814 0.0179599 -0.0413353 0.0212433 0.0071058 0.0340711 0.0877329 -0.1253436 0.1573087 -0.0000431 0.0029633 -0.000061 0.0452485 -0.0000002 -0.1103899 0.000043 0.0645583 3.3045319 -0.0002906 -0.0585024 -0.0002918 1.9903336 0.0001987 -0.3356261 0.0002809 2.3819461 -1.074972 0.0941752 -0.0573124 0.1111497 -1.0600228 0.4164787 0.0343054 0.2971992 -0.9922467 -1.0749686 -0.0942049 -0.0573488 -0.1111459 -1.0604773 -0.4164313 0.0342432 -0.297254 -0.9917358 -0.5262294 0.0000402 -0.0501924 0.0000204 -0.122378 -0.0000805 -0.0369676 -0.0000999 -0.3556561 -0.0847286 -0.1673558 0.0278015 0.1622519 -0.0557167 0.0200669 0.0262642 -0.0734877 -0.0424616 -0.0847272 0.1673957 0.0276562 -0.1622137 -0.0556366 -0.0200708 0.0264115 0.0734793 -0.0424956 -0.1100205 0.1967581 0.0065365 0.0866641 0.0195597 0.0260647 -0.0055984 0.0632457 -0.1153309 0.1185975 0.0650973 -0.0098173 0.046334 0.0570374 0.0065207 0.0033463 0.0249128 0.12378 -0.1100771 -0.1967248 0.0066807 -0.0866382 0.0195591 -0.0261783 -0.0055336 -0.0633462 -0.1152692 0.118563 -0.0651309 -0.0097609 -0.0463426 0.0570506 -0.0064652 0.0033738 -0.0248654 0.1238086 0.0802072 0.0000301 0.0821231 0.0000159 0.0555385 -0.0000511 0.0634922 -0.000053 -0.0657955 0.0383515 -0.0628879 -0.0282439 -0.0714621 -0.0246146 -0.0216904 -0.0391109 -0.0195 0.1280603 0.0383806 0.0628562 -0.0282885 0.0714195 -0.0246119 0.0218169 -0.0391575 0.0196252 0.1280291 -0.0555686 -0.0000056 -0.0632295 -0.0000059 0.1001747 0.0000121 -0.0637916 0.0000142 0.1113204 unknown
polarizability: 177.3329461|0.0032904|151.5797617|12.3648474|-0.0192711|100.7982975 unknown
InChI: InChI=1S/C10H10O2S/c11-13(12,10-6-8(10)7-10)9-4-2-1-3-5-9/h1-5,8H,6-7H2
charge 0 multiplicity 1
23 atoms
C  2.40319738 -1.14691918 -1.23053446
C  1.65027759 -0.00042783 -0.62726612
C  2.40406688 1.14524044 -1.23101448
C  3.13653328 -0.00098989 -0.6150945
H  2.39953233 -2.08050788 -0.66075083
H  2.37945951 -1.25830737 -2.32190368
H  2.40109499 2.07906756 -0.6616176
H  2.38042248 1.25619545 -2.32243032
H  3.78230894 -0.00105953 0.26145818
S  0.68398319 0.00020458 0.83150248
O  0.93014852 -1.26593387 1.51978176
O  0.93043226 1.26677698 1.51887663
C  -1.0027104 0.00017346 0.25645361
C  -1.64283842 -1.21837638 0.03566006
C  -1.64255433 1.21869907 0.03469978
C  -2.95541397 -1.21133966 -0.43160528
H  -1.11935552 -2.15405841 0.23885544
C  -2.95513193 1.21159924 -0.43255787
H  -1.11885459 2.1544201 0.2371564
C  -3.60762757 0.00011327 -0.66665534
H  -3.47305833 -2.15625214 -0.60726393
H  -3.47255784 2.15649328 -0.60895806
H  -4.63706243 0.00008972 -1.03091785
