program: Gaussian 16
title: Title Card Required
version: ES64L-G16RevA.03
method: RwB97XD
basis: def2SVP
operation: Freq
keyword: #N
keyword: Geom=AllCheck
keyword: Guess=TCheck
keyword: SCRF=Check
keyword: GenChk
keyword: RwB97XD/def2SVP
keyword: Freq
converged: YES YES YES YES
title: Mulliken charges:
elementType: C C H H C H H C H H C
charge: -0.065999 -0.101393 0.072682 0.072682 -0.101402 0.072680 0.072735 -0.101402 0.072735 0.072680 -0.065999
chargesum: -0.00000
title: Mulliken charges with hydrogens summed into heavy atoms:
elementType: C C C C C
charge: -0.065999 0.043971 0.044013 0.044013 -0.065999
chargesum: 0.00000
1716.lowfreq: -53.2368 -32.9342 -28.2629 -0.0007 0.0004 0.0015 532.0642 532.5793 622.4323
frequency: 532.0642 532.5793 622.4323 748.1775 748.5074 919.2987 932.2009 957.3292 1076.7859 1078.1132 1102.6874 1102.7065 1123.0741 1161.8790 1162.1549 1174.6166 1255.7129 1255.7587 1475.8414 1476.0137 1519.1603 3145.1107 3145.8484 3151.5557 3247.1243 3250.8412 3251.4967
redmass: 1.8201 1.8211 4.9647 2.5346 2.5371 1.0078 6.0545 1.2295 1.2298 1.2295 1.8019 1.8027 1.2643 1.5354 1.5358 4.0918 3.4991 3.4982 1.2124 1.2122 1.2537 1.0580 1.0579 1.0594 1.1188 1.1207 1.1206
irintensity: 0.2025 0.2185 216.2031 0.0000 0.0001 0.0000 0.0001 0.0001 0.0000 0.0004 2.5597 2.5355 21.2389 0.0001 0.0000 0.0001 2.6866 2.6992 3.7337 3.8015 0.0000 18.9495 19.0967 0.0921 0.0800 4.7810 4.8659
temp: 298.150 k
press: 1.00000 atm
elementType: 6 6 1 1 6 1 1 6 1 1 6
symmnumber: 1
zpe: 246126.1 jmol-1
zpe.correction: 0.093744 hartree
zpe.thermalcorrener: 0.097685 hartree
zpe.thermalcorrenthalpy: 0.098629 hartree
zpe.thermalcorrgfe: 0.067460 hartree
zpe.sumelectzpe: -193.716037 hartree
zpe.sumelectthermal: -193.712096 hartree
zpe.sumelectthermalent: -193.711152 hartree
zpe.sumelectthermalfe: -193.742321 hartree
dipole: 0.0000 0.0004 -0.0000
dipole: 0.0004
quadrupole: -26.9925 -26.9941 -36.6732
quadrupole: 0.0000 -0.0000 0.0000
quadrupole: 3.2274 3.2258 -6.4533 0.0000 -0.0000 0.0000
hfenergy: -193.809781 hartree
pointgroup: CS [SG(C3H6),X(C2)]
dipole: 0. 0.0001406 0. debye
dipolederiv: -0.0754754 0. 0. 0. -0.0747835 0.0003718 0. -0.0010415 -0.8687899 -0.0016691 0. 0. 0. 0.1644629 0. 0. 0. 0.3325171 -0.0328304 0.0903689 0. 0.0284157 0.0021379 0. 0. 0. 0.1232593 -0.0328304 -0.0903689 0. -0.0284157 0.0021379 0. 0. 0. 0.1232593 0.1224566 0.0724127 0. 0.0716581 0.038283 0. 0. 0. 0.3336978 0.0443557 0.0166446 0. -0.04524 -0.0750816 0. 0. 0. 0.1229869 -0.057672 0.0135924 0. 0.0754805 0.0272127 0. 0. 0. 0.1225873 0.1224566 -0.0724127 0. -0.0716581 0.038283 0. 0. 0. 0.3336978 -0.0576719 -0.0135924 0. -0.0754805 0.0272127 0. 0. 0. 0.1225873 0.0443557 -0.0166446 0. 0.04524 -0.0750816 0. 0. 0. 0.1229869 -0.0754754 0. 0. 0. -0.0747835 -0.0003719 0. 0.0010415 -0.8687899 unknown
polarizability: 58.4092972|0.|58.3931894|0.|0.|47.2051684 unknown
InChI: InChI=1S/C5H6/c1-4-2-5(1,4)3-4/h1-3H2
charge 0 multiplicity 1
11 atoms
C  0.0000 -0.00001715 0.77187113
C  0.0000 1.29955408 0.0000
H  -0.92214288 1.88778995 0.0000
H  0.92214288 1.88778995 0.0000
C  -1.12547894 -0.6497903 0.0000
H  -1.17385229 -1.74250954 0.0000
H  -2.09595499 -0.14525 0.0000
C  1.12547894 -0.6497903 0.0000
H  2.09595499 -0.14525 0.0000
H  1.17385229 -1.74250954 0.0000
C  0.0000 -0.00001715 -0.77187113
