program: Gaussian 16
title: Title Card Required
version: ES64L-G16RevA.03
method: UwB97XD
basis: def2TZVP
operation: Freq
keyword: #P
keyword: Geom=AllCheck
keyword: Guess=TCheck
keyword: SCRF=Check
keyword: GenChk
keyword: UwB97XD/def2TZVP
keyword: Freq
converged: YES YES NO YES
polarizability: 2.08001885e+02 3.12979636e+01 1.83388498e+02 1.60254367e+01 -1.49193940e+01 1.73477179e+02
1716.lowfreq: -12.2139 -5.7019 0.0008 0.0020 0.0030 7.5022 30.1562 44.2910 81.7514
frequency: 29.9159 44.2703 81.7428 92.8309 95.6513 150.3246 189.0903 197.8514 207.7222 233.4613 240.6853 266.7487 287.3532 318.8313 330.4436 337.0943 359.0875 368.4531 410.1678 418.6574 430.4402 469.9769 479.0058 486.7607 563.6744 573.5904 581.0871 583.2361 599.6875 615.9599 631.0425 667.9411 706.8108 714.4178 743.9256 785.4946 797.7151 807.2555 845.2184 855.3210 861.1406 876.6161 957.2784 973.9765 987.1176 1016.3816 1018.5330 1026.5484 1039.6043 1041.6612 1058.7416 1088.9494 1093.7695 1116.1885 1122.1801 1189.7313 1192.2673 1210.9502 1218.7112 1263.4438 1301.7524 1314.5267 1336.1877 1357.3781 1381.2332 1457.6933 1471.4192 1494.3771 1530.1244 1657.7977 1661.5151 3073.7668 3088.4815 3116.3411 3130.0335 3207.2284 3219.3577 3227.4386 3242.9442 3244.7284 3260.8350
redmass: 4.9514 9.7758 7.0317 3.0098 2.8697 11.1431 6.6620 7.4723 9.2599 6.0862 1.5741 7.1224 3.5745 3.4550 5.7497 4.7487 13.5765 7.4200 12.6768 2.9315 9.2206 6.9794 5.2292 14.4176 8.4228 14.9589 16.2003 11.7760 18.7490 9.5394 6.4259 15.2081 3.3687 1.9100 4.9365 1.9155 5.2469 1.4214 7.0752 20.2405 11.0876 1.3096 2.7531 1.4052 1.4604 1.7837 1.6705 4.3077 1.6581 3.6120 2.6885 3.2107 1.1602 2.9178 1.5744 3.5732 1.1380 1.4782 1.4469 1.4163 2.2659 1.6301 3.9427 1.5672 11.5040 1.0721 1.1016 2.2206 2.0920 5.8661 5.6692 1.0592 1.0594 1.1032 1.1018 1.0873 1.0908 1.0953 1.0938 1.0953 1.0936
irintensity: 1.1265 0.6883 0.7833 1.8903 2.7882 3.8337 1.2214 0.6951 0.4170 2.3067 40.9702 6.3422 2.1254 5.9398 1.8309 8.4192 4.0383 8.4047 3.2307 0.2241 3.9235 3.7666 6.9975 1.8318 98.5746 30.1253 21.9066 135.3407 1.0947 60.6317 0.2451 48.4110 3.2172 81.3041 95.4133 10.1705 169.0503 12.0595 326.3985 444.5349 432.2363 28.0811 50.7968 8.7993 1.1050 4.4481 3.8555 4.5037 6.4359 10.2979 1.7668 2.0103 0.1945 57.6027 9.7742 188.2042 1.2467 47.6801 36.3291 0.3680 1.5504 5.3259 7.5944 47.9905 222.9175 22.1812 1.3517 28.0686 3.9310 0.4899 10.5217 11.8577 8.3498 1.2020 5.0201 0.7789 7.3162 8.9396 1.5689 4.6741 9.2926
temp: 298.150 k
press: 1.00000 atm
elementType: 6 6 6 6 1 1 1 1 1 16 8 8 6 6 6 6 1 6 1 6 1 1 1 16 9 9 9 9 9
symmnumber: 1
zpe: 518748.0 jmol-1
zpe.correction: 0.197581 hartree
zpe.thermalcorrener: 0.214734 hartree
zpe.thermalcorrenthalpy: 0.215678 hartree
zpe.thermalcorrgfe: 0.152171 hartree
zpe.sumelectzpe: -1832.892060 hartree
zpe.sumelectthermal: -1832.874907 hartree
zpe.sumelectthermalent: -1832.873962 hartree
zpe.sumelectthermalfe: -1832.937470 hartree
dipole: 2.4125 0.4989 3.9283
dipole: 4.6369
quadrupole: -105.1813 -123.9959 -122.0537
quadrupole: 13.2523 4.6088 -8.4339
quadrupole: 11.8957 -6.9189 -4.9768 13.2523 4.6088 -8.4339
hfenergy: -1833.0896408 hartree
pointgroup: C01 [X(C10H10F5O2S2)]
dipole: 0.9491501 0.1962718 1.5455081 debye
polarizability: 208.0018849|31.2979636|183.388498|16.0254367|-14.919394|173.4771788 unknown
InChI: InChI=1S/C10H10F5O2S2/c11-19(12,13,14,15)10(7-4-8-10)18(16,17)9-5-2-1-3-6-9/h1-6H,7-8H2
charge 0 multiplicity 2
29 atoms
C  -0.90225291 -1.40290303 1.57269063
C  -0.97355924 -0.76684181 0.14805651
C  -2.08271321 -1.80280057 -0.23782417
C  -1.85374616 -2.44319194 1.0882065
H  0.08979868 -1.73975863 1.8730526
H  -1.28105844 -0.75386015 2.36275102
H  -1.86081086 -2.39255182 -1.12969382
H  -3.06644378 -1.35341913 -0.37723361
H  -2.09965005 -3.42287784 1.46466557
S  0.51100026 -1.18705738 -0.86111127
O  0.73285162 -2.57395513 -0.55993055
O  0.25256275 -0.79881088 -2.21540274
C  1.90067209 -0.28785153 -0.24013121
C  2.54052452 -0.73628191 0.90935752
C  2.38315515 0.80065133 -0.95310757
C  3.65432879 -0.05533196 1.36998082
H  2.19578101 -1.62321204 1.42102905
C  3.50506175 1.46602177 -0.48975255
H  1.89114242 1.11281711 -1.86266952
C  4.13187988 1.04624131 0.6746053
H  4.15704718 -0.39516711 2.26550014
H  3.89076031 2.31280795 -1.04144723
H  5.00618285 1.57251187 1.03535858
S  -1.52520253 1.01728737 0.114313
F  -0.35031387 1.52885858 -0.81780755
F  -0.63402494 1.35981251 1.39214342
F  -2.75819861 0.64310204 1.05602493
F  -2.42402004 0.78708888 -1.17511416
F  -2.05366461 2.51313215 0.15329838
