program: Gaussian 16
title: Title Card Required
version: ES64L-G16RevA.03
frameworkgroup: C4V[C4(FS),2SGV(F2)]
method: UwB97XD
basis: def2TZVP
operation: Freq
keyword: #P
keyword: Geom=AllCheck
keyword: Guess=TCheck
keyword: SCRF=Check
keyword: GenChk
keyword: UwB97XD/def2TZVP
keyword: Freq
converged: YES YES YES YES
polarizability: 3.24011321e+01 -5.19829129e-12 3.24011321e+01 2.48005135e-12 2.79070920e-08 2.28661861e+01
1716.lowfreq: -27.2036 -27.2035 -19.4349 -0.0019 0.0020 0.0027 234.3111 352.2192 352.2192
frequency: 234.3111 352.2170 352.2170 456.9142 520.7859 520.7859 544.7937 572.6118 632.4453 781.1339 781.1339 884.3740
redmass: 18.9984 19.1073 19.1073 18.9984 19.4771 19.4771 21.6413 18.9984 19.1130 26.0052 26.0052 23.0418
irintensity: 0.0000 0.0042 0.0042 0.0000 1.5810 1.5810 43.7639 0.0000 16.4663 659.2204 659.2204 192.5113
temp: 298.150 k
press: 1.00000 atm
elementType: 16 9 9 9 9 9
symmnumber: 4
zpe: 39678.5 jmol-1
zpe.correction: 0.015113 hartree
zpe.thermalcorrener: 0.020585 hartree
zpe.thermalcorrenthalpy: 0.021529 hartree
zpe.thermalcorrgfe: -0.013574 hartree
zpe.sumelectzpe: -897.389381 hartree
zpe.sumelectthermal: -897.383909 hartree
zpe.sumelectthermalent: -897.382965 hartree
zpe.sumelectthermalfe: -897.418068 hartree
dipole: 0.0000 0.0000 0.3188
dipole: 0.3188
quadrupole: -38.9424 -38.9424 -35.4543
quadrupole: 0.0000 0.0000 0.0000
quadrupole: -1.1627 -1.1627 2.3254 0.0000 0.0000 0.0000
hfenergy: -897.4044941 hartree
pointgroup: C04V [C4(F1S1),2SGV(F2)]
dipole: 0. 0. -0.1254092 debye
dipolederiv: 3.8467633 0. 0. 0. 3.8467633 0. 0. 0. 2.3989177 -0.3819878 0. 0. 0. -1.343065 0.0724453 0. -0.119532 -0.3505858 -1.343065 0. 0.0724453 0. -0.3819878 0. -0.119532 0. -0.3505858 -0.3819878 0. 0. 0. -1.343065 -0.0724453 0. 0.119532 -0.3505858 -1.343065 0. -0.0724453 0. -0.3819878 0. 0.119532 0. -0.3505858 -0.3966578 0. 0. 0. -0.3966578 0. 0. 0. -0.9965746 unknown
polarizability: 32.4011321|0.|32.4011321|0.|0.|22.8661861 unknown
InChI: InChI=1S/F5S/c1-6(2,3,4)5
charge 0 multiplicity 2
6 atoms
S  0.0000 0.0000 -0.1936734
F  0.0000 1.60588154 -0.23964695
F  1.60588154 0.0000 -0.23964695
F  0.0000 -1.60588154 -0.23964695
F  -1.60588154 0.0000 -0.23964695
F  0.0000 0.0000 1.348011
