program: Gaussian 09
title: TSsearch from gradient with -368.
version: ES64L-G09RevE.01
frameworkgroup: C1[X(C36H37F15Fe2N2)]
method: UwB97XD
basis: Gen
operation: Freq
keyword: #P
keyword: Geom=AllCheck
keyword: Guess=TCheck
keyword: SCRF=Check
keyword: GenChk
keyword: UwB97XD/ChkBas
keyword: Freq
title: TS search from gradient with -368.
converged: YES YES NO YES
polarizability: 5.07626524e+02 1.62305138e+00 4.30994027e+02 -7.74886638e+00 1.14559853e+01 4.20626482e+02
1716.lowfreq: -3.9746 -0.0008 -0.0006 0.0002 3.3733 6.8098 13.2060 16.0742 20.5985
redmass: 9.0493 13.2479 9.2845 12.0950 14.3311 11.7656 9.3635 11.0812 8.4273 8.8277 7.8271 9.6734 6.3343 5.0588 6.7052 4.7199 5.1790 5.1880 6.1472 6.9279 6.5762 4.9311 7.0804 11.5724 11.0897 6.8855 5.5909 3.4391 1.4746 4.0448 13.2068 9.7488 4.4869 3.0527 5.6814 3.7538 7.2007 13.6453 13.6067 6.6704 8.8463 2.3801 2.9591 1.8196 2.7543 2.1939 6.2696 7.9370 14.2153 5.2498 13.3569 7.6438 4.2031 2.7622 1.3226 1.5749 1.4589 11.9113 6.1253 5.0403 1.4869 2.2893 1.7134 2.1413 2.1778 13.6719 14.2663 13.3309 2.4976 6.2661 9.4218 1.2835 8.8797 2.3162 2.3396 1.6881 2.2364 12.3975 12.5182 2.4575 6.6020 2.5106 2.1016 15.8041 15.6392 10.3830 2.3778 12.9336 15.0713 15.1175 2.7438 2.7070 2.2228 2.8888 2.7099 2.9227 11.1848 16.4258 17.1086 2.4223 3.2065 8.6568 5.7058 8.6089 5.6342 12.1712 12.1800 12.1455 12.0169 11.9758 9.4267 3.0060 2.7991 11.9284 12.7502 12.4245 3.3670 10.7526 13.5203 13.2099 3.2663 1.6977 1.7392 1.9076 1.8404 2.5385 2.6902 1.9868 2.0575 1.5234 1.5686 1.6281 1.6175 5.6961 7.5764 2.1306 6.8584 1.7247 1.7105 1.6558 2.3435 2.0167 1.4376 1.3116 1.4319 1.3577 1.5176 1.6400 11.8592 6.7929 1.7850 12.6138 1.7070 1.3353 1.4496 1.5081 13.1514 11.9738 12.2534 2.1565 2.0638 2.4520 2.2917 2.1418 2.0967 2.9787 1.6571 1.7019 1.7002 2.2773 2.2985 2.1082 1.6635 12.5564 12.3470 12.6247 11.9160 11.9549 11.9275 1.3512 1.6304 6.8368 1.5637 3.4266 2.0677 9.5373 1.4576 1.5901 1.5955 1.4760 1.2937 1.2307 1.3006 1.2809 1.2563 1.2283 1.2196 1.2129 1.2244 1.1450 1.1328 1.2651 1.2792 1.5687 1.2385 1.3257 1.8114 1.5207 1.1414 1.7773 1.1220 1.4017 1.1632 1.1284 1.0793 1.0752 1.0712 1.0801 1.0676 1.0773 1.0647 1.0634 1.0903 1.0566 12.2504 11.5512 12.2460 11.9835 12.0274 12.0406 12.0031 12.0279 12.0141 1.0572 1.0479 1.0579 1.0415 1.0387 1.0582 1.0469 1.0636 1.0632 1.0560 1.0423 1.0597 1.0450 1.0445 1.1002 1.1025 1.0940 1.1010 1.0857 1.1005 1.1004 1.1030 1.1009 1.1000 1.0999 1.0998 1.1004 1.1022 1.1026 1.0989 1.0994 1.1005 1.0998 1.0974 1.0937 1.0953 1.0738
irintensity: 1.1820 0.3455 1.0801 0.4162 0.1828 0.1593 0.1543 0.3026 0.1403 2.8806 0.5841 0.0429 1.3884 0.0611 1.3852 0.5059 2.1345 0.4638 3.4913 0.6686 3.5452 1.3147 3.1203 0.6439 4.8447 0.7102 4.3570 0.2448 0.1438 0.0395 0.3646 0.4249 2.2657 0.7663 6.4153 11.5247 24.6667 32.1914 2.9940 5.4545 5.3435 11.7060 22.5442 14.3498 10.6909 3.3801 0.6040 0.3708 0.0142 0.2131 2.4096 1.7973 3.6465 0.7582 1.8694 0.7607 6.0608 0.3529 0.9301 1.3224 0.2399 2.7218 4.1298 0.2760 0.2374 1.3552 0.4157 0.5627 0.6525 8.0629 11.7785 6.0902 10.1144 0.2856 7.8730 18.2994 2.4812 0.0573 0.0150 0.6717 1.0568 2.2855 3.2194 0.3439 0.5722 0.2413 0.8228 3.7302 1.5558 4.7102 2.6437 0.2936 0.8191 1.6946 6.7309 2.3482 0.8789 0.5440 0.2077 2.8675 0.3584 11.0645 59.4869 33.8160 44.2088 0.0151 0.0265 0.0088 2.5945 3.6122 3.1486 18.7001 1.6637 1.7398 0.0411 0.2716 0.6743 6.7550 10.0086 6.9338 1.5214 16.1263 11.0365 20.7058 4.1511 3.3581 6.9269 7.0815 8.4616 2.1646 1.1565 3.8622 6.7837 24.4650 70.5235 44.3454 299.7453 45.1447 5.3617 1.4026 29.0118 8.1803 5.2338 1.6544 6.6729 0.7633 14.9663 1.5168 296.6506 409.4193 40.8883 48.9207 5.0984 37.5626 3.1955 0.2766 1.3376 8.1623 17.6682 16.5435 22.0649 19.0018 7.3155 0.2227 4.7217 10.4832 5.7451 1.5911 6.2601 28.3324 14.4845 10.6172 9.3572 25.2971 19.3216 33.4427 6.4292 2.1292 5.9683 6.0973 3.5244 57.2890 3.4001 37.3118 18.1385 38.4032 3.7812 4.0290 1.3754 0.4268 3.1126 3.0961 37.2344 4.2606 16.7433 19.2310 4.8427 10.0944 17.1516 11.2728 12.7757 10.0882 75.3752 134.6788 20.7187 56.8302 5.0145 34.5858 14.8361 434.3195 49.3660 190.8024 73.8618 48.6865 2.0462 5.9663 29.6932 12.1229 0.1058 8.7932 3.1447 15.9924 19.6754 15.8653 270.9845 339.6531 156.2991 4.1567 14.1950 11.4929 55.2048 52.8811 50.9591 36.8890 33.2643 14.9856 21.9635 1.3948 3.4761 23.4280 16.2034 26.6713 6.1097 8.3881 11.7038 15.8797 16.0444 26.3144 6.2486 28.6150 24.9641 27.4451 7.6946 39.6200 42.5249 5.6974 0.7588 22.7049 9.5944 12.7188 16.8954 18.7732 11.1013 8.1744 10.8402 17.4327 8.8761 23.3997 2.2463 49.1948
temp: 298.150 k
press: 1.00000 atm
elementType: 26 26 9 9 9 9 9 7 7 6 6 6 6 1 1 6 6 6 1 1 1 6 1 1 1 6 6 6 6 6 6 6 6 1 1 6 6 1 1 6 9 6 9 9 6 9 9 6 1 1 1 6 1 1 1 6 1 1 6 1 1 6 1 1 6 1 1 1 6 1 1 1 6 1 1 1 6 1 1 1 6 6 6 6 6 6 1 9 9 9 9 9
symmnumber: 1
zpe: 1816896.8 jmol-1
zpe.correction: 0.692019 hartree
zpe.thermalcorrener: 0.747938 hartree
zpe.thermalcorrenthalpy: 0.748882 hartree
zpe.thermalcorrgfe: 0.599626 hartree
zpe.sumelectzpe: -3246.637097 hartree
zpe.sumelectthermal: -3246.581178 hartree
zpe.sumelectthermalent: -3246.580234 hartree
zpe.sumelectthermalfe: -3246.729491 hartree
dipole: -5.1328 2.3670 0.2768
dipole: 5.6591
quadrupole: -402.3158 -329.9416 -339.7607
quadrupole: -3.1473 0.8897 -20.2325
quadrupole: -44.9764 27.3978 17.5786 -3.1473 0.8897 -20.2325
hfenergy: -3247.3291162 hartree
pointgroup: C01 [X(C36H37F15Fe2N2)]
dipole: 1.9593096 1.0155457 -0.2946719 debye
polarizability: 507.6395385|1.8843091|426.2090911|-6.8582803|-12.9990182|425.398403 unknown
InChI: InChI=1S/C9H19N.C9H18N.3C6F5.2Fe/c2*1-8(2)6-5-7-9(3,4)10-8;3*7-2-1-3(8)5(10)6(11)4(2)9;;/h10H,5-7H2,1-4H3;5-7H2,1-4H3;;;;;
charge 0 multiplicity 9
92 atoms
Fe -1.36702227 -0.85500318 -0.4603474
Fe 1.69656529 0.09121892 -0.05736816
F  3.5939797 -0.81583538 2.4332612
F  6.24134371 -1.15565371 2.66545398
F  7.88845611 -0.60521127 0.5676288
F  6.83767916 0.29105187 -1.77995061
F  4.19464358 0.62898853 -2.03904662
N  0.59738095 -1.47715325 -0.82600842
N  0.88569481 2.03705273 0.57018257
C  0.84327627 -1.46117163 -2.31823687
C  0.86277694 -2.79575439 -0.12953862
C  1.27446914 3.29951843 -0.18276079
C  0.98747831 4.55872047 0.66967806
H  1.85436421 4.81481333 1.28663919
H  0.84381759 5.40101498 -0.0142022
C  -0.02194011 3.25249246 2.5790196
C  0.93025243 2.13466285 2.08052656
C  2.36353138 2.36864077 2.5764274
H  3.06295587 1.66925472 2.11481535
H  2.38802761 2.1997758 3.6563948
H  2.72027425 3.38336502 2.39847009
C  0.46124451 0.78374903 2.61802606
H  -0.48856178 0.47218948 2.17418877
H  0.30150174 0.84481001 3.6979187
H  1.21840338 0.00722451 2.46691948
C  3.7630238 -0.08046449 0.1846117
C  4.36260206 -0.53195003 1.35105409
C  5.72905057 -0.71782536 1.51264299
C  6.57294234 -0.43805508 0.44550473
C  6.03253716 0.01929173 -0.74947072
C  4.65702709 0.18243687 -0.84236322
C  -2.860974 -1.80141014 0.61378099
C  -0.2421663 4.36759417 1.5486246
H  -0.98681379 2.81615236 2.85024094
H  0.40570125 3.66805356 3.4975144
C  -3.88143245 -2.37185577 -0.12814134
C  -3.03313786 -1.85423101 1.98456914
H  -1.10190974 4.12254682 0.91509044
H  -0.50360755 5.30024142 2.05465547
C  -5.00561746 -2.96718912 0.42612702
F  -3.79192535 -2.36484279 -1.48214148
C  -4.13286783 -2.43468461 2.60244354
F  -2.08887962 -1.32375125 2.8015299
F  -5.96223992 -3.50924572 -0.33402293
C  -5.12766937 -2.99513909 1.81050496
F  -4.25178072 -2.46407801 3.93400121
F  -6.19419077 -3.56067432 2.37706957
C  2.74593884 3.24650414 -0.59125249
H  2.92541659 2.46834962 -1.33814694
H  3.02980881 4.20283193 -1.04101245
H  3.40608203 3.06349008 0.25768009
C  0.41281758 3.37044218 -1.44831036
H  0.7440361 4.21043754 -2.06390637
H  0.50311611 2.46563122 -2.04871446
H  -0.64540177 3.52197803 -1.21492392
C  2.38240086 -3.50312128 -2.04755019
H  3.37965787 -3.88003198 -2.29469564
H  1.67144304 -4.23720094 -2.44316871
C  2.23373069 -3.3640016 -0.5379525
H  2.37259592 -4.33009369 -0.04056671
H  3.01969983 -2.69552526 -0.16463292
C  2.17643738 -2.14019903 -2.69306261
H  2.99816944 -1.48645382 -2.38095986
H  2.23058357 -2.20965073 -3.78524488
C  -0.31859443 -2.08811398 -3.11368713
H  -0.34597229 -3.17403916 -3.03631883
H  -1.29694897 -1.70746191 -2.79319922
H  -0.2226144 -1.83329411 -4.17322522
C  0.94677114 0.00884021 -2.73881757
H  1.11769282 0.09125918 -3.8154977
H  0.03267952 0.55526775 -2.50744842
H  1.81398297 0.51195528 -2.2803654
C  -0.22329439 -3.8605046 -0.38504562
H  -0.02227674 -4.72950472 0.24909948
H  -1.21739846 -3.490457 -0.12335841
H  -0.25292498 -4.21284594 -1.41454927
C  0.87703676 -2.51784069 1.37460221
H  -0.05900907 -2.06580224 1.71923084
H  1.0105526 -3.44898283 1.93240182
H  1.71599792 -1.87299641 1.65470791
C  -2.1962036 0.98807289 -1.02169085
C  -2.5004338 1.39986174 -2.30983749
C  -3.17504501 2.57546536 -2.61431104
C  -3.60684205 3.39163305 -1.57575939
C  -3.35982103 3.01356466 -0.26200233
C  -2.67238638 1.82961505 -0.02967104
H  -0.10389362 1.89536937 0.3538289
F  -3.77934549 3.78847295 0.74331944
F  -4.25664953 4.52450421 -1.83670561
F  -3.42083851 2.93045863 -3.87764268
F  -2.12385052 0.64152962 -3.36588051
F  -2.45110969 1.51286395 1.27240312
