program: Gaussian 09
title: Fix NH from nonafc TS structure and reading correct chk file.
version: EM64L-G09RevA.02
frameworkgroup: C1[X(C36H37F15Fe2N2)]
method: UwB97XD
basis: Gen
operation: Freq
keyword: #P
keyword: Geom=AllCheck
keyword: Guess=TCheck
keyword: SCRF=Check
keyword: GenChk
keyword: UwB97XD/ChkBas
keyword: Freq
converged: YES YES NO NO
title: Mulliken atomic charges:
elementType: Fe Fe F F F F F N N C C C C H H C C C H H H C H H H C C C C C C C C H H C C H H C F C F F C F F C H H H C H H H C H H C H H C H H C H H H C H H H C H H H C H H H C C C C C C H F F F F F
charge: 0.330577 -0.340806 -0.359203 -0.398548 -0.391636 -0.401475 -0.348063 -0.342895 -0.477448 0.170222 0.164030 0.185647 -0.236495 0.115979 0.114614 -0.237045 0.197013 -0.352219 0.142081 0.126286 0.125370 -0.368628 0.133818 0.152819 0.134488 -0.154005 0.291272 0.400453 0.349436 0.403798 0.285132 -0.304717 -0.214048 0.139934 0.114521 0.326512 0.348672 0.117215 0.117907 0.402348 -0.367989 0.405955 -0.372516 -0.392341 0.354903 -0.393526 -0.384734 -0.345138 0.130425 0.121368 0.135363 -0.332550 0.121443 0.124316 0.120269 -0.237944 0.137004 0.114599 -0.217467 0.121842 0.142680 -0.216986 0.141897 0.123153 -0.346492 0.140348 0.150346 0.140757 -0.368724 0.158409 0.144900 0.160451 -0.354977 0.136485 0.173303 0.128573 -0.357195 0.149743 0.147431 0.141361 -0.438870 0.407096 0.404130 0.381674 0.398747 0.436784 0.401639 -0.397141 -0.376780 -0.376636 -0.330594 -0.351704
chargesum: -0.00000
title: Mulliken charges with hydrogens summed into heavy atoms:
elementType: Fe Fe F F F F F N N C C C C C C C C C C C C C C C C C C C F C F F C F F C C C C C C C C C C C C C C C F F F F F
charge: 0.330577 -0.340806 -0.359203 -0.398548 -0.391636 -0.401475 -0.348063 -0.342895 -0.477448 0.170222 0.164030 0.185647 -0.005903 0.017410 0.197013 0.041519 0.052496 -0.154005 0.291272 0.400453 0.349436 0.403798 0.285132 -0.304717 0.021074 0.326512 0.348672 0.402348 -0.367989 0.405955 -0.372516 -0.392341 0.354903 -0.393526 -0.384734 0.042018 0.033478 0.013658 0.047055 0.048064 0.084959 0.095036 0.083384 0.081339 -0.037231 0.407096 0.404130 0.381674 0.398747 0.436784 -0.397141 -0.376780 -0.376636 -0.330594 -0.351704
charge: -3.747704 3.814098 0.000248 -0.000404 0.001271 -0.000355 -0.000140 -0.082192 0.049554 -0.000957 0.002400 0.002174 0.002535 -0.000154 0.000287 0.003170 0.000089 0.004918 -0.001758 -0.000242 -0.000166 -0.002189 0.002505 0.003125 -0.002838 0.007143 0.023769 -0.011090 0.021060 -0.011193 0.024324 -0.011948 -0.000400 -0.000127 0.000550 -0.026275 -0.023970 0.000130 0.000017 0.011421 -0.000772 0.011993 -0.000149 0.000614 -0.022385 0.000626 -0.001507 0.003539 -0.000355 0.000029 0.000352 0.001526 -0.000124 0.000018 -0.000073 -0.000121 0.000012 0.000202 0.000978 -0.000509 -0.000251 0.000246 -0.000084 -0.000717 -0.010445 0.000109 0.004989 -0.001087 0.009594 0.003872 0.000042 -0.007205 -0.008701 -0.000523 0.003821 0.000076 -0.000841 0.002805 0.000673 -0.001502 0.018673 -0.029234 0.014499 -0.023360 0.014294 -0.028913 -0.004115 0.000177 -0.001310 0.000257 0.000914 -0.001332
polarizability: 5.76654294e+02 -3.95695943e+00 3.86257815e+02 -1.45664070e+00 2.07147278e+00 4.08898540e+02
1716.lowfreq: -1078.2964 -7.9023 -4.7077 -0.0008 -0.0006 -0.0002 7.7822 13.4752 17.3262
redmass: 1.1290 8.6105 12.8186 12.8369 9.4566 8.7983 8.9688 11.3433 11.8900 8.8552 8.8525 8.4299 10.6283 4.9063 4.4653 4.3941 6.2479 6.6056 4.5483 8.3249 8.1021 10.0538 6.9814 9.2409 3.5899 11.1677 4.4737 2.3914 2.3033 4.9958 5.1229 7.1022 11.3269 5.3163 6.6517 5.0252 3.6242 3.2831 2.9408 1.9121 4.9836 6.2564 3.7428 4.9481 5.4009 2.0826 2.2528 15.4895 18.7160 15.8793 3.7774 5.7362 9.1619 2.4257 4.9035 1.9892 1.8884 15.1194 8.7786 3.0173 2.9766 2.0958 1.4770 2.5578 1.8554 7.4912 13.6762 15.8251 1.5759 8.4053 2.2996 7.0799 1.2690 2.5405 3.7920 2.6135 2.0923 2.7552 4.4320 2.6180 4.8386 8.6102 2.0363 2.3665 15.9293 15.0047 8.2775 6.2441 15.8093 3.1266 9.5047 2.6204 2.7273 2.1193 2.5847 2.5762 16.9342 17.1321 5.7911 2.9930 2.9853 10.9610 10.1662 11.1881 4.7335 4.5834 12.1558 12.1638 12.0926 11.2729 12.0126 11.9810 9.6592 2.8019 11.5519 12.6834 2.5914 3.1452 13.6094 3.3230 13.6826 5.9430 1.6462 1.5380 2.2866 2.2101 2.7083 2.5224 1.9071 2.1944 1.5158 1.6546 1.5924 1.4912 8.2805 11.9323 1.7841 1.6155 8.1598 1.7862 1.6685 2.2716 2.0572 1.5090 1.4899 1.3638 1.3836 1.5667 1.6304 12.7876 1.6593 1.5971 13.3617 1.4422 1.3980 11.0133 11.9102 13.1137 3.8027 3.5421 2.2178 2.4745 2.3303 2.6180 2.1727 2.3249 2.9807 1.7563 2.0889 1.7173 2.1110 2.1353 1.7763 12.5148 12.4838 6.4798 6.6747 6.2172 1.8499 11.9732 1.3373 1.1803 1.4420 9.4387 1.5256 3.0483 2.3243 1.5485 5.4614 1.8995 1.5085 1.2860 1.2865 1.2619 1.6014 1.4208 1.3319 1.4001 1.2176 1.2236 1.0700 1.0746 1.0701 1.5817 1.3785 1.2598 1.1371 1.1268 1.1049 1.0762 2.4096 1.0850 1.3146 1.0903 1.1111 1.1244 1.0743 1.0765 1.0656 1.0695 1.0676 1.0599 1.0777 1.0564 12.4395 12.2541 12.0543 1.7790 11.9711 10.2750 8.3104 11.6506 12.0133 12.0161 1.0497 1.0510 1.0444 1.0665 1.0426 1.0595 1.0509 1.0608 1.0603 1.0497 1.0505 1.0494 1.0617 1.0462 1.1010 1.0988 1.1025 1.1037 1.0920 1.0900 1.0953 1.0978 1.0988 1.1004 1.0998 1.0971 1.0974 1.0942 1.0989 1.1016 1.0995 1.0989 1.0980 1.0967 1.0936 1.0950
irintensity: 4407.5667 0.1481 0.4951 0.1678 0.1779 0.5613 0.2530 0.1740 0.3683 0.2200 0.0165 0.1944 0.3852 0.7259 0.6174 0.6605 0.3021 1.4653 0.3460 6.0517 2.9354 4.5084 1.5365 0.2698 0.5146 0.6924 1.7302 1.2897 1.2794 1.7192 10.3976 2.0334 1.8662 3.1418 13.3654 15.4481 10.6075 12.2299 29.4077 5.8204 3.9412 17.5147 5.9819 11.1625 15.1574 2.4907 3.2149 0.6619 0.0394 0.0964 9.1016 2.9649 1.2289 1.6991 11.5570 3.6744 1.7619 1.1146 1.1652 5.8011 2.1347 0.5607 0.4291 0.3334 3.3602 3.9668 2.1664 0.0329 2.2380 12.5939 3.9509 17.0250 4.1629 25.5541 10.4197 0.1269 0.9407 1.9806 1.2573 4.8204 1.5130 0.5892 4.4600 1.7514 0.3960 0.4180 0.0258 5.0087 2.9627 1.5813 2.5318 1.3947 12.0478 0.0155 17.2943 9.8349 0.2809 0.5055 3.4088 4.0656 6.9010 26.7716 6.2912 17.4161 87.0499 32.9210 0.0346 0.0570 0.0806 3.5836 2.5713 2.3448 0.0437 10.7816 0.1149 0.0299 7.4066 2.3448 13.2668 1.6222 3.7262 91.6849 1.8449 0.5732 39.3702 5.4217 11.4735 2.6439 5.1290 4.5647 0.8899 3.9283 1.6396 1.5642 114.2789 92.6978 11.7419 8.8076 147.3386 6.7135 5.2662 57.5938 21.0200 6.4768 8.4348 8.8593 3.6371 3.0962 1.8857 314.3118 0.2482 3.0304 192.3741 2.2430 7.1877 421.5591 9.5894 10.1144 25.1290 1.6717 23.9177 31.4564 5.4512 13.4332 0.3163 0.7953 11.6192 8.7402 3.0553 1.6776 13.7313 19.2692 12.4973 24.1398 27.7455 2.6863 38.8112 46.5798 40.6137 4.3290 4.9535 121.9059 0.8241 32.2378 3.2345 25.0784 27.9177 0.7296 9.1970 2.1977 0.1666 5.3793 18.8205 5.5310 50.9069 24.0044 25.0746 103.6241 19.0349 10.5133 10.7301 0.6103 2.8981 141.3578 49.7168 43.4518 18.0633 20.9263 27.9376 6.6993 294.3337 13.2401 71.3138 6.3431 19.7564 44.4465 9.5051 10.9192 4.1385 12.9579 22.5216 14.0631 8.5111 11.5381 317.1184 161.5347 211.0516 171.4604 12.0563 3.0192 12.7952 81.3289 52.6679 88.9953 10.7167 15.0739 24.2634 21.8700 15.8109 13.9377 0.5921 10.0526 23.1581 7.5127 40.0739 23.2959 28.6671 23.2723 21.3934 43.9064 49.5160 15.2504 6.6368 34.5598 7.6565 19.1673 26.1909 7.8884 33.8643 17.2069 31.5767 11.3382 21.8868 18.4814 6.9346 18.3987 13.2315 4.4018 24.7468 9.9295
temp: 298.150 k
press: 1.00000 atm
elementType: 26 26 9 9 9 9 9 7 7 6 6 6 6 1 1 6 6 6 1 1 1 6 1 1 1 6 6 6 6 6 6 6 6 1 1 6 6 1 1 6 9 6 9 9 6 9 9 6 1 1 1 6 1 1 1 6 1 1 6 1 1 6 1 1 6 1 1 1 6 1 1 1 6 1 1 1 6 1 1 1 6 6 6 6 6 6 1 9 9 9 9 9
symmnumber: 1
zpe: 1799822.2 jmol-1
zpe.correction: 0.685516 hartree
zpe.thermalcorrener: 0.740859 hartree
zpe.thermalcorrenthalpy: 0.741803 hartree
zpe.thermalcorrgfe: 0.596990 hartree
zpe.sumelectzpe: -3246.590810 hartree
zpe.sumelectthermal: -3246.535467 hartree
zpe.sumelectthermalent: -3246.534523 hartree
zpe.sumelectthermalfe: -3246.679335 hartree
dipole: 0.6284 0.1718 -1.7103
dipole: 1.8301
quadrupole: -407.5482 -312.7497 -347.5145
quadrupole: -1.7728 -0.7043 5.7515
quadrupole: -51.6108 43.1878 8.4230 -1.7728 -0.7043 5.7515
hfenergy: -3247.2763257 hartree
pointgroup: C01 [X(C36H37F15Fe2N2)]
dipole: 0.246888 0.0844594 -0.6710877 debye
polarizability: 576.7088059|-2.3112787|386.1248103|-1.4613259|1.5567382|408.9770332 unknown
InChI: InChI=1S/2C9H18N.C6HF5.2C6F5.2Fe/c2*1-8(2)6-5-7-9(3,4)10-8;3*7-2-1-3(8)5(10)6(11)4(2)9;;/h2*5-7H2,1-4H3;1H;;;;/q;-1;;;;;+1
charge 0 multiplicity 1
92 atoms
Fe -1.13884125 -0.74204684 -0.21642143
Fe 1.81767088 0.21696806 -0.0577587
F  3.70109175 -0.60105753 2.48963505
F  6.31613731 -1.09139685 2.7427695
F  7.9584877 -0.97884621 0.57035407
F  6.9236329 -0.36464656 -1.87411305
F  4.3131925 0.12067958 -2.15832987
N  0.66508653 -1.50683009 -0.54342403
N  1.08733225 2.10017914 0.1942378
C  0.90545965 -1.76843774 -2.01525142
C  0.81380763 -2.70744939 0.37290911
C  1.56007011 3.201076 -0.7199757
C  1.31037443 4.59797547 -0.08998373
H  2.18313027 4.93658569 0.47780821
H  1.18263802 5.32317998 -0.90043602
C  0.34169451 3.66575116 2.01824781
C  1.22558778 2.44008217 1.65072433
C  2.68049127 2.72160734 2.09626394
H  3.35862182 1.93288664 1.7623021
H  2.71605759 2.75210817 3.19032045
H  3.0639873 3.67653053 1.73673147
C  0.78904789 1.20990154 2.45540986
H  -0.1558437 0.79004668 2.10534549
H  0.64735132 1.46823207 3.50897779
H  1.56545379 0.43778263 2.43911748
C  3.86691224 -0.21434159 0.15258858
C  4.46117128 -0.53091326 1.36503489
C  5.81400019 -0.79042197 1.54118275
C  6.65478917 -0.73445899 0.43776238
C  6.1222314 -0.42057647 -0.80547041
C  4.75985211 -0.17308084 -0.90806746
C  -3.04583988 -1.34714762 0.23927286
C  0.08767478 4.57961091 0.8169065
H  -0.60704791 3.33738444 2.44494513
H  0.85274909 4.23127351 2.80597132
C  -4.02562426 -1.51958396 -0.72164101
C  -3.46688015 -1.49230533 1.5500496
H  -0.77840595 4.22069264 0.24732338
H  -0.16287924 5.5899437 1.15369316
C  -5.35286731 -1.80247074 -0.42705453
F  -3.69804575 -1.39239852 -2.0308717
C  -4.77634909 -1.77720001 1.91074628
F  -2.56768287 -1.33963424 2.55050401
F  -6.26570341 -1.95139896 -1.38842356
C  -5.72626705 -1.93014425 0.90636804
F  -5.1381791 -1.90617415 3.18806418
F  -6.9899628 -2.20389356 1.22109536
C  3.04305019 3.05600683 -1.10145319
H  3.20402368 2.16922178 -1.72212197
H  3.36207455 3.92450753 -1.68851531
H  3.69465175 2.97901537 -0.2310548
C  0.75938393 3.16022056 -2.02596685
H  1.17572247 3.88333607 -2.73338282
H  0.80378235 2.18041332 -2.49913831
H  -0.28904478 3.42219055 -1.86719912
C  2.26404089 -3.85958057 -1.3713494
H  3.22827366 -4.35034939 -1.53480329
H  1.49712356 -4.59320095 -1.64479669
C  2.13052765 -3.44774115 0.08868567
H  2.184855 -4.320055 0.74929709
H  2.96619599 -2.78917622 0.3518859
C  2.17153118 -2.61791555 -2.24630984
H  3.04599588 -1.99152527 -2.04549471
H  2.21306061 -2.88208309 -3.30884951
C  -0.31482434 -2.40803375 -2.70547015
H  -0.48745991 -3.44043827 -2.4062234
H  -1.24018374 -1.84741945 -2.51151616
H  -0.17086787 -2.39931324 -3.78995372
C  1.13431792 -0.41412044 -2.68913654
H  1.32840849 -0.54707696 -3.75722777
H  0.26301517 0.23364347 -2.59479797
H  2.02798464 0.09918323 -2.30592112
C  -0.36127561 -3.70568282 0.27770148
H  -0.26036538 -4.44857249 1.07448927
H  -1.33145951 -3.21784739 0.41372272
H  -0.3942102 -4.24900334 -0.66508565
C  0.84563439 -2.18923328 1.81066747
H  -0.06367532 -1.63456339 2.0748874
H  0.91465754 -3.02532401 2.51182657
H  1.71778082 -1.55702002 1.98623045
C  -1.65554453 1.58032073 -0.28321578
C  -2.2587463 1.57489777 -1.54795341
C  -3.62026787 1.73268726 -1.77150798
C  -4.46532482 1.91256999 -0.68617039
C  -3.93164963 1.93687084 0.59558209
C  -2.56602199 1.77647092 0.76520671
H  -0.39495219 1.79956928 -0.08066432
F  -4.73794039 2.0905613 1.64322757
F  -5.76996469 2.04879524 -0.8686909
F  -4.11868016 1.70384092 -3.00340362
F  -1.52526865 1.37010982 -2.65601735
F  -2.1477242 1.77103185 2.03737242
