program: Gaussian 09
title: FeFe-2CH-fix-scanCHb-ts-disp-Bbb-disp-bf2-solv.com
version: ES64L-G09RevE.01
frameworkgroup: C1[X(C36H37F15Fe2N2)]
method: UwB97XD
basis: Gen
operation: Freq
keyword: #P
keyword: Geom=AllCheck
keyword: Guess=TCheck
keyword: SCRF=Check
keyword: GenChk
keyword: UwB97XD/ChkBas
keyword: Freq
converged: YES YES NO YES
polarizability: 5.83059906e+02 2.40953938e+01 4.10941396e+02 1.15163445e+01 -7.13031259e+00 3.99550138e+02
1716.lowfreq: -14.9531 -7.2248 -6.2750 -0.0009 -0.0005 0.0005 8.6296 15.2951 18.5323
redmass: 10.6965 11.4094 9.2871 10.6813 11.0607 8.8936 11.8615 10.5845 11.6544 13.1824 9.4514 5.7316 5.3355 5.0067 12.8344 3.5829 6.1112 9.0312 10.3976 4.2013 5.3572 4.5813 4.3162 15.1050 12.9524 4.0853 5.7004 3.1646 6.8589 4.4296 14.5092 13.8849 16.6827 4.1150 5.2694 4.9761 1.0859 12.6287 14.1069 2.8038 5.3563 1.9662 2.1656 1.7911 2.8016 17.9952 18.3062 16.2026 18.6049 14.6533 13.2334 1.6949 2.3835 3.2905 14.7426 2.4597 16.3488 12.6728 1.3252 1.7069 2.2679 14.5033 1.6878 1.4145 5.5575 2.8481 8.7836 3.6797 2.3025 3.1484 7.8876 6.2969 1.8643 1.8614 2.1659 2.1929 12.6171 2.4310 11.6240 2.0521 9.3080 1.3822 2.0057 10.6832 15.8919 15.9178 14.1468 2.1966 14.7812 14.3376 3.1857 2.9048 2.2320 2.6669 2.7879 3.6557 17.3769 17.2795 16.7051 2.7931 2.4848 8.0005 12.1101 4.2077 3.9387 12.1320 12.1742 12.1805 10.4867 5.4366 12.0579 12.0628 9.7541 12.7475 12.7628 2.6452 2.7090 3.0304 9.0886 12.6820 3.1492 1.5352 1.4671 1.5027 2.1154 2.0975 2.3914 2.5406 2.0091 2.1864 1.4985 1.5985 1.5447 1.5886 10.6097 10.8058 1.7626 6.2334 1.5335 1.6927 1.7618 1.4766 1.7111 1.5419 2.0092 1.7751 1.3774 1.5571 1.7102 13.0740 11.8239 1.6011 1.5965 11.9158 1.4631 1.4513 12.6638 12.9599 2.4668 4.7891 2.1599 2.5483 2.2088 2.1750 2.2115 2.2120 2.4391 3.1285 1.9805 1.8907 2.1971 2.3924 1.8136 1.7636 12.6457 12.6414 11.7007 11.4016 7.1786 1.5272 11.6546 1.2957 1.4837 9.9443 9.4499 1.4499 1.5017 1.4772 1.5695 1.4655 1.3243 1.2751 1.2854 1.2907 1.2389 1.2280 1.2330 1.2353 10.5315 1.0823 1.0730 1.0763 1.1319 1.1411 1.1054 3.1380 2.4302 1.2820 1.0737 1.1468 1.1716 1.0575 1.0794 1.0730 1.0830 1.0595 1.0802 1.0648 1.0747 1.0761 1.0578 1.0522 1.0521 11.9443 12.3077 12.1360 6.6969 12.0323 12.0288 12.0234 12.0309 11.4280 9.9659 1.0534 1.0496 1.0525 1.0478 1.0631 1.0602 1.0501 1.0505 1.0543 1.0621 1.0445 1.0438 1.0461 1.0617 1.0995 1.1016 1.1027 1.0936 1.0887 1.1037 1.0958 1.0894 1.0866 1.1027 1.1025 1.1018 1.1008 1.0970 1.1002 1.1012 1.1013 1.1009 1.0995 1.0963 1.0983 1.0948 1.0934
irintensity: 0.0671 0.7571 0.6745 0.1363 0.1339 0.1146 0.1114 0.0839 0.1287 0.2815 0.0387 0.2427 1.0976 0.3643 0.1486 0.3020 0.6219 1.2231 1.8428 1.2407 1.2001 5.0576 8.6561 0.0534 0.0552 0.0909 0.2764 0.3255 2.8899 0.3142 0.3354 0.2095 0.3284 1.6077 18.3260 11.7127 0.8615 8.6028 2.0579 16.0890 1.1387 11.4050 2.0171 3.3146 5.0564 0.0437 0.0579 0.0560 0.0283 0.0485 1.5558 0.5114 4.9132 0.0696 0.4078 2.8882 0.2719 0.2114 0.2528 1.1070 1.0327 2.7018 1.2447 0.1469 0.2666 0.2391 0.0836 0.0924 3.8623 0.1777 4.7991 8.7360 1.5353 1.7714 0.4158 1.6984 0.0367 0.7849 0.0605 4.3395 0.1698 0.4274 4.5302 0.2517 0.2971 0.3353 0.5132 0.6019 4.8414 1.6023 0.1801 0.0871 1.2657 4.4492 3.4141 2.4540 0.1646 0.1580 0.0195 0.9845 0.8198 1.6395 9.4731 1.0030 1.1608 0.0328 0.0128 0.0007 0.0134 2.0582 2.2980 2.1388 21.5175 0.0292 0.0400 7.2901 1.9583 2.0827 2.0682 12.3373 2.1512 14.7946 33.8957 0.7051 21.1410 9.7083 19.9622 18.2932 3.4638 2.2352 1.8029 1.7967 1.8456 2.0464 59.8799 166.8092 7.7464 220.6653 3.7381 1.4791 11.8819 1.0268 7.0293 2.7687 9.8214 20.9964 1.1425 1.5188 5.6998 291.2870 199.0133 2.2215 1.7391 196.5327 3.3871 6.5795 7.9550 9.5843 16.9878 10.3439 30.1405 97.4084 13.4758 15.5458 27.4007 1.8575 4.5258 3.2407 29.5207 4.2153 0.6652 30.9783 6.0088 21.1269 39.9246 19.1719 9.8943 4.8615 4.7869 5.4070 2.8722 8.8027 0.5355 141.2775 3.2460 1.4125 1.5513 7.6029 1.7862 3.7732 13.3384 4.1807 13.6777 0.7074 8.3332 15.6076 25.0849 4.8385 5.9847 2.1626 5.6708 0.1232 9.4263 50.4934 9.4106 405.7539 155.6163 16.9521 1.0205 33.0867 10.0445 5.1478 5.6406 21.5183 36.6392 9.3861 8.4204 10.7207 30.0735 9.2833 9.0115 3.2502 14.0771 143.8380 264.4181 277.4981 422.5513 10.1862 8.5358 47.8927 59.2394 38.5550 4.5380 25.4317 31.6150 14.2646 6.3020 17.9270 14.7162 2.2649 39.8611 14.2018 32.2062 13.1951 15.5919 32.6301 29.4120 33.1846 19.7474 20.4145 5.3469 18.5600 34.8094 44.4858 10.4446 23.6530 34.0741 29.6301 29.3979 18.2596 27.3310 6.2460 4.2010 14.0755 9.0346 15.7791 9.4510 12.4588 29.0670 9.8606
temp: 298.150 k
press: 1.00000 atm
elementType: 26 26 9 9 9 9 9 7 7 6 6 6 6 1 1 6 6 6 1 1 1 6 1 1 1 6 6 6 6 6 6 6 6 1 1 6 6 1 1 6 9 6 9 9 6 9 9 6 1 1 1 6 1 1 1 6 1 1 6 1 1 6 1 1 6 1 1 1 6 1 1 1 6 1 1 1 6 1 1 1 6 6 6 6 6 6 1 9 9 9 9 9
symmnumber: 1
zpe: 1810131.7 jmol-1
zpe.correction: 0.689443 hartree
zpe.thermalcorrener: 0.745663 hartree
zpe.thermalcorrenthalpy: 0.746608 hartree
zpe.thermalcorrgfe: 0.594099 hartree
zpe.sumelectzpe: -3246.585570 hartree
zpe.sumelectthermal: -3246.529349 hartree
zpe.sumelectthermalent: -3246.528405 hartree
zpe.sumelectthermalfe: -3246.680914 hartree
dipole: -0.9737 -1.1148 -1.9211
dipole: 2.4251
quadrupole: -410.8377 -315.0195 -343.5891
quadrupole: -23.3826 0.9422 -2.0351
quadrupole: -54.3556 41.4626 12.8930 -23.3826 0.9422 -2.0351
hfenergy: -3247.2750126 hartree
pointgroup: C01 [X(C36H37F15Fe2N2)]
dipole: -0.3882069 -0.4353402 -0.7550684 debye
polarizability: 583.6954072|21.5874993|410.2178205|11.6591888|-7.2974566|399.638213 unknown
InChI: InChI=1S/2C9H18N.C6HF5.2C6F5.2Fe/c2*1-8(2)6-5-7-9(3,4)10-8;3*7-2-1-3(8)5(10)6(11)4(2)9;;/h2*5-7H2,1-4H3;1H;;;;
charge 0 multiplicity 9
92 atoms
Fe -0.11910836 0.40926402 -0.10060061
Fe -2.49461402 -0.07826522 -0.17082243
F  -4.50128799 0.67489886 2.27832921
F  -7.15085041 0.35507519 2.61614888
F  -8.64571641 -0.83451901 0.67572897
F  -7.45862724 -1.70064335 -1.61553543
F  -4.8075378 -1.37959458 -1.97128361
N  -1.62468039 1.76354601 -0.45212148
N  -0.97406545 -1.44923452 -0.15406492
C  -2.05551447 2.28169804 -1.79133929
C  -1.57319901 2.773132 0.65831622
C  -0.50511293 -2.14359444 -1.40154916
C  0.35918975 -3.38235443 -1.0648059
H  -0.26514966 -4.27349921 -0.943166
H  1.01650875 -3.58455967 -1.91676239
C  0.2354755 -3.01122206 1.40734094
C  -1.11122782 -2.31730593 1.05534457
C  -2.23511953 -3.36108071 0.87943271
H  -3.16934733 -2.87222766 0.58299752
H  -2.40761741 -3.87543602 1.83002733
H  -1.99506834 -4.12443257 0.13886471
C  -1.51139095 -1.43984461 2.24523571
H  -0.76208735 -0.67213588 2.45105227
H  -1.59350205 -2.05567464 3.14568467
H  -2.49703836 -0.9706891 2.11308236
C  -4.54227411 -0.33165717 0.13447208
C  -5.20380505 0.08270711 1.27754744
C  -6.56718823 -0.06804685 1.49050903
C  -7.33362937 -0.67471504 0.50310828
C  -6.72361165 -1.11512466 -0.66476132
C  -5.35518628 -0.93302951 -0.8117459
C  1.87252485 0.7787802 0.40688691
C  1.16663145 -3.14031848 0.20227824
H  0.74221714 -2.44772089 2.19687001
H  0.01624106 -4.00250223 1.81985567
C  2.73781147 1.36459794 -0.50106036
C  2.40687626 0.57541724 1.66619843
H  1.74003365 -2.21313832 0.08876816
H  1.8898981 -3.94702037 0.36130053
C  4.04016922 1.74297514 -0.20260243
F  2.30903987 1.60455915 -1.76531852
C  3.69761735 0.93213278 2.03325355
F  1.63861919 0.00896137 2.63214332
F  4.83583809 2.30758975 -1.11631376
C  4.51867011 1.52892537 1.0843602
F  4.16161681 0.7164057 3.26685853
F  5.76275259 1.88803044 1.40401655
C  -1.68074379 -2.54854788 -2.30164768
H  -2.2232665 -1.67435186 -2.6713346
H  -1.31497485 -3.10236393 -3.17309866
H  -2.39404649 -3.18014384 -1.7712092
C  0.4127027 -1.18136316 -2.18135877
H  0.59599031 -1.55598294 -3.19218352
H  -0.03040031 -0.18573521 -2.32624488
H  1.38649539 -1.06508359 -1.70031081
C  -3.25551839 4.21585573 -0.58690983
H  -4.22013981 4.72584158 -0.50232264
H  -2.52422416 4.98516322 -0.86033421
C  -2.88745612 3.56833142 0.74017042
H  -2.79446633 4.32232906 1.52992838
H  -3.68870227 2.88234299 1.04148236
C  -3.33335981 3.14148525 -1.66082363
H  -4.1677853 2.46917318 -1.41918591
H  -3.55074815 3.58558519 -2.63881374
C  -0.93832365 3.04886674 -2.52243922
H  -0.76223251 4.04019524 -2.10671269
H  0.00432118 2.49531676 -2.47749953
H  -1.20628742 3.18241653 -3.57552475
C  -2.44527091 1.10182183 -2.69592992
H  -2.92143635 1.48357533 -3.60352188
H  -1.5904921 0.50690448 -3.01617539
H  -3.20633399 0.44496749 -2.2468534
C  -0.37156854 3.73650629 0.54520897
H  -0.24091261 4.26311892 1.49576626
H  0.55040867 3.18658378 0.33631722
H  -0.49461505 4.49552075 -0.22616363
C  -1.40252656 2.01616812 1.97956933
H  -0.43159281 1.5047478 2.0497013
H  -1.42216219 2.71966585 2.81674283
H  -2.20976396 1.29903883 2.14655521
C  4.7687663 -1.97897725 0.28034296
C  4.71951732 -1.56600967 -1.03952669
C  5.74636713 -0.82447154 -1.60954754
C  6.85113967 -0.49189988 -0.83386257
C  6.92547104 -0.90298369 0.49307711
C  5.88055489 -1.6410589 1.03483369
H  3.96125401 -2.55575558 0.71224788
F  7.99067982 -0.59066221 1.22461352
F  7.84326253 0.21309123 -1.36367871
F  5.68316562 -0.43970446 -2.88156436
F  3.66658285 -1.88872114 -1.80234863
F  5.96191725 -2.03201598 2.30857707
