program: Gaussian 09
title: for 2nd C-H activation TS.
version: EM64L-G09RevA.02
frameworkgroup: C1[X(C21H19F10FeN)]
method: UwB97XD
basis: Gen
operation: Freq
keyword: #P
keyword: Geom=AllCheck
keyword: Guess=TCheck
keyword: SCRF=Check
keyword: GenChk
keyword: UwB97XD/ChkBas
keyword: Freq
converged: YES YES YES YES
title: Mulliken atomic charges:
elementType: Fe N C C C C C C C C C H H H H H H H H H H H H H H H H H H C C C C C C H F F F F F C C C C C C F F F F F
charge: 0.681751 -0.929697 0.177876 0.176420 -0.214538 -0.213141 -0.233548 -0.390117 -0.387153 -0.347793 -0.347442 0.156503 0.154731 0.116713 0.116892 0.133539 0.108743 0.144888 0.143860 0.148403 0.149765 0.171045 0.169828 0.130370 0.130545 0.126173 0.125754 0.148531 0.148075 0.374449 -0.395809 0.367147 0.394554 0.360608 0.395830 0.367334 -0.393712 -0.383305 -0.393260 -0.394303 -0.393120 0.289317 -0.196989 0.283396 0.412461 0.339195 0.418681 -0.401908 -0.391851 -0.407542 -0.417169 -0.330980
chargesum: -0.00000
title: Mulliken charges with hydrogens summed into heavy atoms:
elementType: Fe N C C C C C C C C C C C C C C C F F F F F C C C C C C F F F F F
charge: 0.681751 -0.562363 0.177876 0.176420 0.058678 0.058482 0.008734 0.074219 0.076300 0.057281 0.056931 0.374449 -0.395809 0.367147 0.394554 0.360608 0.395830 -0.393712 -0.383305 -0.393260 -0.394303 -0.393120 0.289317 -0.196989 0.283396 0.412461 0.339195 0.418681 -0.401908 -0.391851 -0.407542 -0.417169 -0.330980
charge: 3.782695 0.129559 0.000851 0.000350 0.002111 0.002194 -0.000135 0.005075 0.005262 0.006344 0.006099 -0.000060 -0.000057 0.000721 0.000732 0.000071 -0.000002 0.001577 0.001138 -0.003437 -0.003451 -0.000291 -0.000268 -0.000077 -0.000053 -0.000204 -0.000203 -0.001292 -0.001297 0.034303 -0.004633 0.034736 -0.017838 0.031283 -0.017882 -0.005450 -0.001059 0.002061 -0.001061 0.002284 0.001805 -0.001421 0.017160 -0.000285 0.000866 -0.000798 0.002078 -0.000273 0.000012 0.000085 0.000135 -0.010058
polarizability: 3.27624658e+02 1.04921306e+01 2.49043293e+02 1.92785624e+00 -1.80919240e-01 2.16870682e+02
1716.lowfreq: -1105.2162 -6.0350 -0.7639 -0.0008 0.0005 0.0008 6.9225 9.4216 13.5444
frequency: -1105.2162 7.1586 13.4973 16.9532 24.5944 38.2462 50.9895 54.0380 67.7383 79.7377 109.5384 112.1428 117.6842 128.8827 129.9524 133.6541 138.9814 155.6802 165.9730 170.2618 186.2348 216.6011 220.6658 223.1294 253.8214 275.1257 276.0426 276.0588 278.2923 283.4773 287.7952 290.9558 294.1974 312.2331 317.3169 326.3622 333.3400 348.9419 357.6227 364.0968 367.7283 370.5401 404.6809 414.3216 428.4961 430.0274 434.9265 450.8727 454.8844 483.8967 490.4811 499.0450 499.5852 539.8374 573.4370 586.1544 595.0529 607.2823 639.1366 650.8941 679.7257 689.9003 707.9616 733.1537 740.3127 749.9632 759.9376 783.2134 792.6682 809.0028 881.6600 885.1997 923.2975 931.4224 940.6182 947.6932 951.8798 977.2325 983.1983 990.7248 1012.1780 1021.0264 1039.0779 1056.8568 1085.7115 1093.5529 1102.6885 1118.7006 1121.2514 1158.6403 1169.1050 1228.9055 1244.9016 1253.5781 1270.9801 1284.2169 1290.2519 1294.5154 1315.3212 1334.2756 1340.0936 1350.4783 1371.3303 1379.9334 1399.4180 1404.3424 1405.9688 1422.1049 1429.2890 1440.9825 1447.6190 1474.1675 1483.2117 1491.1862 1493.0042 1500.2517 1500.9254 1508.9154 1514.5989 1519.0708 1519.4531 1524.5042 1527.0452 1543.4316 1566.2189 1570.6339 1607.1311 1657.4968 1690.7443 1691.3831 1703.2920 1712.4905 3013.8356 3018.0897 3063.1595 3066.7717 3069.7236 3070.7530 3074.9114 3120.7817 3121.7299 3124.4321 3127.4654 3133.4661 3136.7092 3139.2565 3177.0862 3178.1723 3179.2265 3198.5145
redmass: 1.0793 12.5231 11.0448 14.9042 7.2526 8.6011 4.2191 4.7723 9.7968 15.9244 4.8404 10.4677 3.9904 13.2254 11.8255 2.5642 5.3592 1.2780 16.5304 12.1192 16.5797 2.6379 4.1018 10.7173 5.5698 1.7978 10.4180 16.7311 4.7393 16.3852 1.5586 1.8431 1.2920 17.8943 2.3085 11.3306 2.4950 3.2496 6.0282 7.0306 11.0991 8.2976 2.2037 2.5073 12.6337 2.0664 12.4998 16.0615 16.0652 10.9555 2.2425 8.3358 3.6286 2.4106 16.3295 17.2413 2.6663 11.3334 10.6073 4.6530 12.1651 12.1917 11.9901 11.5669 12.0263 12.7813 2.9480 2.9581 5.5424 13.3851 1.4857 2.2791 12.1492 3.2569 1.9726 1.4505 1.5296 1.6719 14.2669 1.6276 1.5597 1.4851 1.7791 12.5120 1.6662 1.7291 13.0854 1.4349 11.7855 12.7250 1.9794 2.3123 2.2093 3.0365 1.6785 2.5523 12.2172 2.0399 12.7788 11.9973 1.4531 9.7333 6.5260 1.4738 2.9996 2.7289 1.4979 1.2742 1.2990 1.2232 1.2348 3.9983 1.0607 1.0641 1.0654 1.0783 1.0729 1.0750 1.0767 1.0880 5.3800 1.1211 1.0833 1.0583 11.5850 12.4580 1.4619 1.0856 8.1454 12.0401 12.0336 9.3687 1.0552 1.0549 1.0419 1.0459 1.0591 1.0596 1.0668 1.1031 1.1018 1.0825 1.0830 1.1028 1.1004 1.1006 1.1000 1.1018 1.1022 1.0943
irintensity: 5408.4577 0.1640 0.8003 0.3526 0.0406 0.0356 0.1551 0.0056 0.9633 0.4370 3.4443 6.9032 2.9116 0.8677 0.3852 1.4605 0.5922 0.0101 2.9276 0.0111 45.4196 2.4293 0.2369 4.1380 25.3779 0.5243 0.3129 0.0958 3.2366 1.8555 5.4228 0.5846 0.8991 0.3495 8.5247 2.3165 0.1193 2.2258 6.0492 4.3774 6.0258 29.0856 4.8204 0.0319 0.0100 9.5146 0.0391 0.3761 11.8305 1.6659 0.1502 4.1949 0.8982 19.7660 20.7516 0.4522 31.9677 1.9574 7.9748 36.9909 0.0742 0.0098 0.1938 0.9272 5.2095 0.1124 14.3037 1.9321 79.6461 1.2184 0.1229 25.7366 413.5429 64.6887 2.7222 0.7870 3.0187 1.2964 183.1222 8.0918 5.0414 16.4946 9.9598 276.6197 1.5987 32.2203 252.7029 3.7780 25.7989 7.8025 22.7541 9.8074 1.0424 37.8621 0.7307 26.9763 55.4308 31.0213 40.5883 0.3059 1.6715 3.3770 52.3169 0.2486 34.5540 20.9182 1.8255 1.6473 7.4564 35.5217 38.1239 264.8673 4.3093 2.0313 1.3774 20.7567 1.2498 0.3518 2.6795 17.5814 409.3667 68.6406 18.0097 19.7947 216.3867 218.6772 119.4186 6.3666 26.6705 6.7090 69.9925 16.7610 26.1458 30.6342 0.9053 36.1689 26.9549 4.2825 26.2665 18.3540 20.4058 11.7914 11.1614 36.2837 37.1932 41.5745 8.4135 13.0051 11.4957 30.1559
temp: 298.150 k
press: 1.00000 atm
elementType: 26 7 6 6 6 6 6 6 6 6 6 1 1 1 1 1 1 1 1 1 1 1 1 1 1 1 1 1 1 6 6 6 6 6 6 1 9 9 9 9 9 6 6 6 6 6 6 9 9 9 9 9
symmnumber: 1
zpe: 968488.3 jmol-1
zpe.correction: 0.368878 hartree
zpe.thermalcorrener: 0.401644 hartree
zpe.thermalcorrenthalpy: 0.402588 hartree
zpe.thermalcorrgfe: 0.299953 hartree
zpe.sumelectzpe: -1987.337144 hartree
zpe.sumelectthermal: -1987.304378 hartree
zpe.sumelectthermalent: -1987.303434 hartree
zpe.sumelectthermalfe: -1987.406068 hartree
dipole: -0.0146 5.3944 -0.0153
dipole: 5.3945
quadrupole: -240.3599 -194.6044 -195.8829
quadrupole: 4.4852 -0.5181 0.0207
quadrupole: -30.0775 15.6780 14.3995 4.4852 -0.5181 0.0207
hfenergy: -1987.7060217 hartree
pointgroup: C01 [X(C21H19F10Fe1N1)]
dipole: 0.0104206 2.1223254 0.0003849 debye
polarizability: 327.7807849|9.8859297|248.8887666|1.9360122|-0.1007507|216.8690811 unknown
InChI: InChI=1S/C9H19N.2C6F5.Fe/c1-8(2)6-5-7-9(3,4)10-8;2*7-2-1-3(8)5(10)6(11)4(2)9;/h10H,5-7H2,1-4H3;;;
charge 0 multiplicity 5
52 atoms
Fe -0.64012749 0.14084992 -0.01261564
N  0.72540822 1.55422126 0.00104898
C  0.83920771 2.28992546 1.29857868
C  0.8436556 2.32103836 -1.27841728
C  2.13165671 3.12515825 1.28184146
C  2.13795675 3.15244205 -1.23696704
C  2.25043979 3.99960856 0.03200161
C  0.92499891 1.21525588 2.39455233
C  0.92929221 1.27521049 -2.40171804
C  -0.38918756 3.16217287 1.60945415
C  -0.38099476 3.2048595 -1.57123125
H  2.98648889 2.43950727 1.31405095
H  2.99139577 2.46524066 -1.27920193
H  2.17331853 3.73927697 2.18846732
H  2.18613761 3.78562212 -2.13004765
H  3.21503735 4.51576911 0.04033402
H  1.48494851 4.78436665 0.038198
H  1.06928554 1.68499705 3.37117231
H  1.0809133 1.77043964 -3.36453098
H  -0.01297652 0.64086951 2.46908855
H  -0.00971528 0.70627989 -2.49504951
H  1.75130007 0.52229098 2.22256671
H  1.75116482 0.57365757 -2.24414821
H  -0.36913612 3.45006721 2.66492107
H  -0.35714527 3.51696202 -2.61971386
H  -0.42638785 4.08066878 1.02440815
H  -0.41620299 4.11011875 -0.96569126
H  -1.32030896 2.61079632 1.43305168
H  -1.31473596 2.65353121 -1.41011411
C  -3.33849766 -0.43183917 -1.15530831
C  -2.60277311 -0.33262865 0.01330638
C  -3.30577538 -0.53612894 1.1885003
C  -4.66249051 -0.82509062 1.22568184
C  -5.35770261 -0.91727311 0.02453354
C  -4.69556972 -0.71879125 -1.18242404
H  1.6920183 0.76918469 -0.00737805
F  -5.37048683 -0.80587866 -2.33011381
F  -6.65940763 -1.19288591 0.03020727
F  -5.30670069 -1.01323843 2.37889404
F  -2.6529828 -0.44939842 2.36979944
F  -2.71569549 -0.23788973 -2.34091045
C  2.0626283 -1.58579541 -0.09343021
C  2.64619101 -0.35284837 -0.02015221
C  4.02367241 -0.37733218 0.04579206
C  4.76614471 -1.55291589 0.03918666
C  4.10347609 -2.77539498 -0.03740129
C  2.71526478 -2.80682655 -0.10616114
F  2.06685501 -3.97206125 -0.17918123
F  4.79864396 -3.91381378 -0.04432919
F  6.10070998 -1.53963763 0.10534729
F  4.71740814 0.78377873 0.12302335
F  0.65223324 -1.6497408 -0.16237146
