program: Gaussian 09
title: TS disp with factor 0.5.
version: ES64L-G09RevE.01
frameworkgroup: C1[X(C28H45F5FeN2O)]
method: UwB97XD
basis: Gen
operation: Freq
keyword: #P
keyword: Geom=AllCheck
keyword: Guess=TCheck
keyword: SCRF=Check
keyword: GenChk
keyword: UwB97XD/ChkBas
keyword: Freq
converged: YES YES NO YES
polarizability: 3.84057323e+02 4.22372635e+00 3.37473093e+02 7.54077259e+00 -7.96637768e+00 3.09803798e+02
1716.lowfreq: -14.0589 -7.6384 -0.0004 0.0004 0.0005 4.7251 19.0297 23.4855 25.8909
frequency: 18.0572 23.1518 25.2892 33.2449 40.1831 48.1137 51.4514 54.9563 65.1584 67.7737 76.2233 79.6445 82.1355 85.3373 93.1913 103.7052 104.6085 122.6085 130.8859 132.4325 149.9935 152.8532 155.1245 170.1734 170.9156 183.0674 187.5478 195.2178 225.6203 226.4312 255.6428 272.2672 275.2981 276.7437 282.6187 287.2417 292.4585 293.3197 298.5881 301.3454 303.4762 307.3404 315.3025 318.1829 320.9971 331.8049 335.9129 343.8238 350.0585 362.8535 368.7853 394.9516 397.6754 413.2108 416.6512 418.8839 430.0242 438.7268 453.0933 484.7663 486.8864 491.5421 495.7164 504.9588 507.6718 536.9825 550.1604 583.7090 586.5871 596.7063 602.3928 627.1912 632.4375 686.0273 700.7353 723.5417 734.8367 743.6881 758.9727 777.2329 780.1838 781.6759 816.9350 865.5359 872.6841 878.3330 891.6900 907.5293 914.9176 930.1714 932.4345 933.7823 936.0126 939.8282 952.8143 961.6602 962.2523 968.0815 971.7408 972.4893 976.2135 980.0089 991.6308 992.1952 995.3751 1006.2167 1013.8056 1019.7608 1021.9169 1035.5678 1054.3907 1069.4280 1083.2073 1083.7715 1086.4344 1087.4028 1093.0165 1100.2760 1111.5006 1117.2355 1139.0901 1156.6852 1166.6647 1169.2719 1183.9854 1220.2709 1234.8118 1239.3931 1241.0600 1242.1932 1243.8838 1250.4604 1254.7214 1265.3978 1267.5614 1273.3888 1285.3076 1285.8947 1289.5301 1294.9846 1296.4501 1297.5897 1333.1180 1334.6440 1336.4209 1356.0068 1364.8279 1378.6762 1380.4567 1382.6884 1390.0393 1397.6495 1399.0395 1403.0417 1404.3573 1405.7805 1412.8858 1418.3775 1424.0225 1426.9623 1433.5777 1435.9810 1441.0184 1449.2427 1480.3486 1484.1421 1486.4763 1488.7624 1490.8924 1492.4811 1495.9055 1498.3793 1499.3994 1501.6984 1503.6986 1504.9575 1505.9409 1509.2851 1512.7728 1513.1091 1515.1369 1517.1432 1518.9862 1520.6260 1527.7205 1528.3861 1530.7882 1538.2462 1539.0381 1547.6482 1550.6800 1552.3865 1565.5901 1687.3265 1699.9021 3007.2000 3038.7859 3042.4992 3048.1951 3051.0181 3054.2507 3060.6597 3061.2533 3064.0049 3065.6056 3069.6151 3069.8892 3072.2779 3074.6699 3083.6272 3091.8893 3095.3252 3097.0942 3110.6875 3111.1361 3116.4843 3119.8521 3122.2755 3126.0843 3129.5496 3134.1537 3134.7970 3140.1173 3141.4714 3141.8738 3146.8594 3147.8084 3149.8472 3151.4668 3155.8467 3156.6082 3159.4525 3165.4553 3168.8677 3173.8275 3174.0185 3196.9123 3201.5383 3212.3946 3478.1571
redmass: 8.3631 5.6871 5.6412 5.3670 3.6223 3.7342 6.3747 5.4479 3.6224 3.3818 2.3316 5.3916 4.1708 3.4888 4.0238 3.6993 8.1393 3.9367 15.9316 3.0144 2.6546 3.2606 3.4985 5.8096 1.7213 1.2672 1.5843 8.4332 7.1127 2.4656 3.3295 1.2309 17.1712 5.8825 2.5533 1.6294 1.5049 1.1814 1.9673 1.8297 2.1585 1.8509 4.5846 1.2318 1.7994 1.9814 2.3121 1.6628 10.4491 1.9668 6.9401 2.2275 2.1867 2.4338 2.3733 1.8852 12.5837 2.0487 15.8604 2.2359 2.2203 13.8704 3.1683 2.9799 2.7150 2.2712 4.1184 13.0445 3.0437 2.1132 2.4946 11.4838 2.1073 12.1754 5.2819 11.6858 2.8237 12.0931 2.5366 12.1130 2.9286 3.0246 1.2025 2.1405 1.5250 1.4765 2.1405 1.6921 3.0293 2.9538 1.8830 1.8618 1.6437 1.6801 2.6083 1.7260 2.1443 1.4951 8.5915 2.7942 1.5172 1.6438 1.6478 1.5610 1.6934 1.6469 1.3643 1.4588 1.2977 1.5889 2.2037 1.9490 11.0853 1.6027 1.7328 1.6536 1.6173 1.3279 1.4166 1.4419 13.2045 4.4162 1.7945 2.0468 2.0743 2.4514 2.3809 1.4606 2.1460 2.1090 3.1154 1.1960 1.4958 1.3106 1.8364 2.1271 2.1338 2.4891 1.9589 2.0084 1.1509 10.3380 1.3626 1.4213 7.1490 1.2369 1.6435 4.2883 1.8253 1.4579 1.3006 1.6047 1.4833 1.6517 1.5304 1.3382 1.3399 1.3679 1.2432 1.2319 1.3339 1.2434 1.2514 1.2374 1.1728 1.0822 1.0745 1.0633 1.0744 1.1312 1.0645 1.4443 1.7852 1.1140 1.1035 1.0704 1.0657 1.0833 1.0607 1.0892 1.0839 1.0685 1.0861 1.0677 1.0805 1.0775 1.0774 1.0787 1.0615 1.0924 1.1025 1.1242 12.1366 12.0227 12.0256 1.0717 1.0703 1.0416 1.0651 1.0664 1.0371 1.0582 1.0379 1.0468 1.0567 1.0472 1.0393 1.0647 1.0616 1.0640 1.0402 1.0627 1.0441 1.0982 1.1005 1.0966 1.1001 1.0936 1.1020 1.1005 1.0980 1.0992 1.1015 1.1013 1.0960 1.0991 1.1014 1.1014 1.1009 1.1030 1.1021 1.1045 1.1027 1.1005 1.0986 1.0992 1.0943 1.0992 1.1000 1.0733
irintensity: 1.3300 0.3018 0.2747 0.1639 0.2285 0.2529 0.3056 1.5576 0.2498 0.7032 0.5285 0.4945 1.7490 2.7266 0.8856 0.4200 3.0758 1.7329 0.1542 2.4291 3.6788 4.9547 1.0655 0.3774 5.0620 1.3127 2.4512 40.8486 4.8518 0.7644 11.8391 1.2168 0.0720 1.6776 2.9356 1.3861 5.0773 0.7106 0.3187 2.9724 0.2290 1.1375 0.2965 0.2835 0.7153 0.4130 0.3428 0.6485 0.6012 3.2461 13.0792 3.6228 2.6159 0.8508 0.0268 1.8414 0.0102 3.8820 0.3871 1.6149 0.6116 2.4904 0.0683 0.4120 1.6720 6.3566 46.4592 0.1245 4.0319 5.4844 5.5108 7.7594 1.4271 0.0080 4.4673 3.5276 4.8054 0.3575 7.6607 13.6981 1.3729 1.9083 2.1961 16.8080 0.2457 0.3926 3.2502 6.3509 8.6403 6.6938 1.1156 0.6295 13.4174 3.8017 38.1832 7.2946 2.8046 1.4275 152.8591 45.7566 20.7877 11.4843 1.1924 5.9703 10.8475 6.4859 13.3605 5.0272 1.3060 5.1621 20.2400 4.3297 252.1894 13.8625 9.2180 4.3352 2.9463 77.8464 2.3152 4.4104 8.0631 57.6865 11.4140 13.7515 48.9692 25.7434 8.0668 7.7767 1.4834 3.2896 11.4349 4.2733 6.3755 1.1229 0.6303 10.3620 57.1366 45.9190 17.2897 43.9196 0.5804 30.9430 6.6284 2.8398 6.8348 2.5521 7.1115 28.5780 6.5517 0.9718 0.3910 3.2600 0.1460 4.3449 0.9204 6.0551 9.7065 9.3291 3.9351 11.2298 21.1775 15.3042 20.6345 4.4732 4.5629 4.1589 6.3695 0.6136 7.4743 29.6039 2.0665 117.2756 218.9930 18.3638 22.5436 8.5356 13.8469 3.7843 0.2698 5.7438 4.1429 14.5871 6.1443 5.2765 11.8179 6.1630 2.5145 1.6100 3.8873 8.6041 11.0644 3.9905 244.0229 9.9879 42.4768 78.9175 90.2029 35.5667 12.8750 21.6657 15.1994 16.2972 23.5340 17.2492 15.0996 34.9320 23.3866 21.1126 40.4745 10.8250 7.6518 25.4331 20.4910 29.7731 38.5967 31.8584 19.5446 37.0553 33.2419 11.6618 16.8075 17.3808 25.3722 38.2286 15.7591 31.4161 64.0974 29.2820 13.0229 17.5518 54.0215 38.2901 5.2739 31.2961 7.3767 14.2132 32.8736 3.8634 24.0459 2.1528
temp: 298.150 k
press: 1.00000 atm
elementType: 26 7 6 6 6 6 6 6 6 6 6 1 1 1 1 1 1 1 1 1 1 1 1 1 1 1 1 1 1 7 6 6 6 6 6 6 6 6 6 1 1 1 1 1 1 1 1 1 1 1 1 1 1 1 1 1 1 6 6 6 6 6 6 1 9 9 9 9 9 8 6 1 1 6 1 1 6 1 1 6 1 1
symmnumber: 1
zpe: 1859271.3 jmol-1
zpe.correction: 0.708159 hartree
zpe.thermalcorrener: 0.749407 hartree
zpe.thermalcorrenthalpy: 0.750351 hartree
zpe.thermalcorrgfe: 0.632322 hartree
zpe.sumelectzpe: -1900.328890 hartree
zpe.sumelectthermal: -1900.287642 hartree
zpe.sumelectthermalent: -1900.286698 hartree
zpe.sumelectthermalfe: -1900.404727 hartree
dipole: 3.7990 7.6945 1.2583
dipole: 8.6730
quadrupole: -261.8306 -220.6878 -236.1126
quadrupole: -1.6692 -2.4028 2.6910
quadrupole: -22.2869 18.8558 3.4310 -1.6692 -2.4028 2.6910
hfenergy: -1901.0370487 hartree
pointgroup: C01 [X(C28H45F5Fe1N2O1)]
dipole: 1.9750821 -2.7488283 -0.431661 debye
polarizability: 384.5596435|3.6483283|338.3875087|4.5690788|-6.3112137|308.3870626 unknown
InChI: InChI=1S/C9H19N.C9H18N.C6F5.C4H8O.Fe/c2*1-8(2)6-5-7-9(3,4)10-8;7-2-1-3(8)5(10)6(11)4(2)9;1-2-4-5-3-1;/h10H,5-7H2,1-4H3;5-7H2,1-4H3;;1-4H2;/q;-1;;;+1
charge 0 multiplicity 5
82 atoms
Fe 0.48710659 0.11728403 -0.0042045
N  1.68944586 1.57572061 0.11752514
C  1.43083852 2.57272784 1.1817785
C  2.48069206 1.99238111 -1.05418544
C  2.70238516 3.37618786 1.52926764
C  3.7510032 2.75187282 -0.6291905
C  3.44384002 3.91074644 0.31109162
C  1.01855046 1.81753251 2.45625536
C  2.90651029 0.72193014 -1.79660618
C  0.27395749 3.53625995 0.83214968
C  1.67407532 2.84095022 -2.06547048
H  3.39446329 2.72505494 2.07301773
H  4.41646851 2.05246512 -0.10790511
H  2.43078652 4.19188108 2.2099053
H  4.28109019 3.10115306 -1.52373737
H  4.37362001 4.39277077 0.62938171
H  2.85238866 4.67868893 -0.20240536
H  0.8495373 2.52073842 3.27824513
H  3.57088098 0.95617332 -2.63455475
H  0.08601804 1.25625364 2.31964113
H  2.02964039 0.21162996 -2.21778074
H  1.80670963 1.12353507 2.76513233
H  3.42519117 0.03433405 -1.12150068
H  0.00721785 4.14532865 1.7032012
H  2.23308422 2.94883041 -3.00212233
H  0.52993523 4.22081555 0.02230099
H  1.46113592 3.84576481 -1.69927965
H  -0.60840718 2.96631783 0.52587377
H  0.71687298 2.35908563 -2.28482496
N  0.57484807 -2.1344396 -0.10621434
C  1.48114501 -2.78879554 0.89953007
C  0.35660698 -2.84498461 -1.41734757
C  1.05441286 -4.25317289 1.10980491
C  -0.05533616 -4.3038831 -1.14333093
C  0.90157897 -5.0289708 -0.19758288
C  1.29587725 -2.01315509 2.20665696
C  -0.78967751 -2.11575219 -2.12443546
C  2.95137635 -2.68119662 0.48673589
C  1.5910408 -2.79040373 -2.32724538
H  0.09192741 -4.25805273 1.64036469
H  -1.06266028 -4.30459318 -0.70341626
H  1.77755696 -4.74440765 1.76992595
H  -0.13100735 -4.83488623 -2.09867289
H  0.52181019 -6.03343863 0.01220759
H  1.87884832 -5.16790025 -0.67465389
H  1.87303951 -2.48572978 3.00681395
H  -1.06417501 -2.65625956 -3.0347802
H  1.66208069 -0.98496451 2.10806007
H  -0.49929519 -1.10023058 -2.41545444
H  0.24820809 -1.98326474 2.51912464
H  -1.6786825 -2.04370283 -1.49061744
H  3.58135343 -2.93787129 1.34291728
H  1.27478935 -2.94234111 -3.36290682
H  3.22422674 -3.35202259 -0.32663335
H  2.32481931 -3.56415681 -2.10072653
H  3.19087382 -1.65732155 0.18920779
H  2.08759644 -1.82190298 -2.26303035
C  -2.29624824 0.91344936 -0.8512871
C  -1.60928166 0.27198477 0.16448397
C  -2.39861193 -0.12914652 1.22513796
C  -3.7686743 0.08588393 1.3075354
C  -4.40272101 0.74504158 0.26205149
C  -3.6610001 1.16445638 -0.83623438
H  -0.34782269 -2.17411685 0.33630953
F  -4.2741396 1.7900108 -1.84740733
F  -5.71823732 0.96693606 0.3078194
F  -4.48328367 -0.32893587 2.3605651
F  -1.8297705 -0.79376522 2.26966304
F  -1.6158288 1.32405322 -1.95344044
O  5.86812005 1.84793751 2.41821849
C  6.5753414 1.0719866 1.46033793
H  6.74170581 1.70427618 0.5848599
H  7.55255935 0.77799304 1.8680707
C  5.08076385 0.94653434 3.17533599
H  5.70173333 0.42577019 3.92219361
H  4.31570112 1.52417292 3.69952478
C  5.70618361 -0.17385358 1.16095952
H  5.36640439 -0.19142146 0.12216174
H  6.27198649 -1.09265919 1.33844037
C  4.52851574 -0.03386366 2.14412565
H  4.22770866 -0.98473347 2.59043009
H  3.66195158 0.4028865 1.6344893
