program: Gaussian 09
title: 000046087
version: EM64L-G09RevD.01
frameworkgroup: C1[X(C15H36N2O)]
method: RPBEPBE
basis: SDD
operation: Freq
keyword: #p
keyword: freq=noraman
keyword: PBEPBE/SDD
title: #p freq=noraman PBEPBE/SDD
converged: YES YES NO NO
title: Mulliken charges:
elementType: O N N C C C C C C C C C C C C C C C H H H H H H H H H H H H H H H H H H H H H H H H H H H H H H H H H H H H
charge: -0.304163 -0.119448 -0.113675 -0.367202 -0.297724 -0.271810 -0.304615 -0.006924 -0.353480 -0.273716 -0.702538 -0.713494 -0.693543 -0.702254 -0.290529 -0.554047 -0.557341 -0.693732 0.266406 0.276663 0.272345 0.263007 0.257618 0.253269 0.268198 0.238993 0.229211 0.281712 0.269956 0.228275 0.229590 0.282365 0.247628 0.238361 0.255701 0.258542 0.243254 0.275669 0.251982 0.239351 0.245891 0.242489 0.255225 0.264172 0.271974 0.271750 0.267233 0.277686 0.276973 0.280416 0.256616 0.253470 0.240144 0.288103
chargesum: 2.00000
title: Mulliken charges with hydrogens summed into heavy atoms:
elementType: O N N C C C C C C C C C C C C C C C
charge: -0.304163 -0.119448 -0.113675 0.175867 0.237628 0.239076 0.202575 0.222287 0.198188 0.184148 0.065816 0.044003 0.073458 0.041352 0.245617 0.262622 0.256664 0.087986
polarizability: 2.05665321e+02 4.15966236e+00 1.67869235e+02 3.59858685e-01 6.42013981e-01 1.54653209e+02
1716.lowfreq: -9.9141 -3.2111 -0.0005 -0.0002 0.0007 12.9528 17.4920 20.8308 42.4103
frequency: 15.8378 18.0955 42.3922 52.2422 71.3315 79.6233 95.0671 99.8770 110.8070 127.5777 147.3136 156.4029 165.8213 196.2447 212.9888 217.8865 232.0833 234.5585 245.2037 249.1878 272.5109 287.1825 294.7926 306.7231 319.3280 335.0945 349.7901 356.8397 371.1273 372.2964 414.9921 429.9479 442.3565 474.7850 485.5189 495.6920 533.3052 563.8569 666.9097 699.1706 765.3118 781.9868 790.5339 793.1693 806.7926 812.2673 831.6086 839.7590 861.4907 898.7057 922.8432 929.2017 946.9122 958.6068 1001.7758 1006.7424 1010.0568 1025.8387 1026.5285 1050.2897 1057.6465 1065.8044 1071.7354 1074.2145 1083.7925 1100.2270 1118.4250 1121.9058 1129.8347 1138.7562 1160.6585 1166.0284 1171.2531 1184.5716 1204.0238 1222.1961 1239.6363 1269.5931 1287.6042 1292.9926 1293.8037 1305.1310 1311.6790 1320.2505 1342.3792 1350.4311 1356.0968 1361.4669 1371.1443 1377.8324 1382.5294 1396.7585 1403.3825 1412.7466 1414.2581 1418.4270 1423.4159 1426.0619 1442.6843 1452.2406 1457.0021 1461.5405 1464.4965 1467.9049 1469.4070 1471.7247 1474.5171 1476.6435 1478.3972 1479.5403 1480.4482 1483.7976 1485.8322 1487.0306 1490.5651 1491.7028 1493.9189 1497.0875 1500.1273 1501.7595 2963.6752 2974.0448 2998.9454 3006.2674 3008.0317 3009.4247 3011.5452 3024.4405 3025.9102 3029.4121 3034.9978 3035.4830 3041.9259 3043.1707 3044.5133 3049.2513 3089.9806 3092.2279 3093.4099 3093.8736 3094.6859 3096.1279 3098.2849 3102.2513 3104.2545 3104.9630 3118.5166 3120.5090 3121.0229 3122.8193 3125.3590 3127.5111 3143.3784 3146.6142 3151.1570 3158.9186
redmass: 2.9535 3.2294 3.4934 3.1653 1.9764 1.9380 1.8249 2.3673 2.3156 1.8583 2.9024 2.7301 2.5633 2.1340 1.2730 1.4075 1.3932 1.4778 1.1786 1.2197 1.2942 1.7682 2.2612 2.0620 2.0191 2.4643 2.2195 2.5034 2.5310 2.3199 2.6174 2.4502 2.9681 2.8793 2.4713 2.6210 2.7924 2.6910 2.9217 3.5163 1.9431 1.6864 1.2386 1.2375 1.4550 1.5214 1.8404 2.1561 1.8057 1.7633 1.9163 2.4755 2.7463 2.1993 4.1304 1.9396 1.9023 2.8166 2.2694 1.7482 1.8818 1.5675 2.2730 1.9736 2.0479 1.9897 1.9324 1.8462 1.7311 1.8569 1.7221 1.6825 1.9883 1.9103 1.6993 1.7296 1.3414 1.1524 1.1089 1.1372 1.1710 1.2071 1.2272 1.2264 1.2199 1.2426 1.2448 1.2954 1.2948 1.2830 1.2867 1.3314 1.2158 1.2060 1.1807 1.2043 1.1691 1.1630 1.1335 1.0799 1.0606 1.0598 1.0667 1.0604 1.0707 1.0619 1.0675 1.0516 1.0486 1.0523 1.0597 1.0457 1.0596 1.0445 1.0488 1.0557 1.0699 1.0574 1.0705 1.0695 1.0568 1.0845 1.0375 1.0380 1.0380 1.0382 1.0383 1.0857 1.0604 1.0439 1.0373 1.0598 1.0611 1.0607 1.0598 1.0599 1.1062 1.0974 1.1017 1.0997 1.0987 1.0975 1.0991 1.1026 1.1006 1.1026 1.1055 1.1039 1.1047 1.1031 1.1038 1.1047 1.1055 1.1052 1.1046 1.1053
irintensity: 0.4094 0.0375 0.5881 0.5953 0.0531 0.1815 0.4742 2.0647 3.4576 1.8222 1.8596 1.9629 0.1268 1.4516 0.0268 0.2929 0.0791 1.7531 0.6410 0.2806 0.3479 1.4902 3.0964 0.7566 0.3639 0.8231 0.4823 0.0309 0.3096 0.0228 0.7233 2.8309 0.4593 2.2391 7.3340 1.8658 1.6892 1.5608 1.7011 2.3252 26.0624 10.3774 21.1470 5.5661 18.4583 9.2343 12.2440 34.8700 2.7846 3.4326 10.1513 13.4731 43.1188 9.2925 48.6123 51.8215 32.1767 34.6338 22.7946 17.2514 10.7815 4.3180 27.2260 5.2662 7.4149 28.3688 3.4740 6.0212 11.3844 6.0056 4.4635 0.4168 3.9522 5.8362 2.4694 0.2772 0.3035 9.6587 4.6897 5.8269 4.5646 3.1976 2.8790 6.5950 1.3406 14.7691 0.0762 2.0171 7.1829 1.2270 4.6377 8.7543 20.2927 33.2950 16.1022 19.1659 40.4012 40.0935 10.8019 12.5723 5.0445 5.5752 5.2078 2.4703 5.2915 25.6016 44.9825 12.7901 15.5523 22.7189 40.1758 22.8200 19.1645 42.3858 21.3758 11.2585 57.3740 7.1587 14.5242 0.0795 37.5113 31.7283 3.0546 3.8599 3.7146 2.6844 3.4904 13.4146 3.0873 10.8382 4.9445 13.0945 5.8908 6.0374 7.1170 2.2300 0.2445 7.9292 5.3379 9.5188 6.1876 4.4160 2.9093 3.9640 13.4795 4.0075 16.4315 7.5178 6.3193 21.8479 27.3345 10.5932 2.5791 2.1438 7.2466 3.2722
temp: 298.150 k
press: 1.00000 atm
elementType: 8 7 7 6 6 6 6 6 6 6 6 6 6 6 6 6 6 6 1 1 1 1 1 1 1 1 1 1 1 1 1 1 1 1 1 1 1 1 1 1 1 1 1 1 1 1 1 1 1 1 1 1 1 1
symmnumber: 1
zpe: 1317370.5 jmol-1
zpe.correction: 0.501760 hartree
zpe.thermalcorrener: 0.525951 hartree
zpe.thermalcorrenthalpy: 0.526896 hartree
zpe.thermalcorrgfe: 0.447558 hartree
zpe.sumelectzpe: -775.793273 hartree
zpe.sumelectthermal: -775.769082 hartree
zpe.sumelectthermalent: -775.768138 hartree
zpe.sumelectthermalfe: -775.847475 hartree
dipole: -4.9626 0.4585 1.4707
dipole: 5.1962
quadrupole: 38.6592 -86.9993 -94.6807
quadrupole: -2.1056 -3.5819 0.4224
quadrupole: 86.3328 -39.3257 -47.0071 -2.1056 -3.5819 0.4224
hfenergy: -776.2950333 hartree
pointgroup: C01 [X(C15H36N2O1)]
dipole: -1.9513891 -0.0350005 0.6084161 debye
polarizability: 205.8618257|2.3939681|164.6284019|2.0855038|5.5377004|157.6975386 unknown
InChI: InChI=1S/C15H36N2O/c1-8-16(6,7)12-13-18-15(5)14-17(9-2,10-3)11-4/h15H,8-14H2,1-7H3
charge 2 multiplicity 1
54 atoms
O  -0.271861 0.562884 0.05956
N  2.826314 -0.394734 -0.07632
N  -4.019181 0.096425 0.387638
C  2.10547 0.95646 -0.289897
C  4.028491 -0.450998 -1.070952
C  1.887108 -1.602325 -0.354133
C  3.325193 -0.485862 1.395697
C  0.899484 1.317097 0.602038
C  -2.524379 -0.170243 0.116555
C  -1.554361 0.871303 0.709492
C  5.151184 0.564109 -0.824831
C  1.357685 -1.720787 -1.787642
C  4.268245 -1.653492 1.713567
C  0.693579 2.845109 0.550917
C  -4.852087 -1.142882 -0.0887
C  -4.273577 0.262982 1.888022
C  -4.501697 1.350204 -0.344494
C  -4.751156 -1.473401 -1.579476
H  2.880417 1.724607 -0.142166
H  1.785982 0.989285 -1.344696
H  4.41099 -1.483436 -1.015151
H  3.594809 -0.303117 -2.073146
H  2.469401 -2.498615 -0.085645
H  1.049622 -1.492328 0.35327
H  3.813301 0.478565 1.614828
H  2.417054 -0.561257 2.017249
H  1.050747 1.009393 1.658031
H  -2.388684 -0.189343 -0.976488
H  -2.301047 -1.173561 0.517148
H  -1.460667 0.775628 1.810779
H  -1.869679 1.904173 0.464484
H  5.936011 0.37252 -1.57822
H  5.629514 0.462097 0.162608
H  4.83741 1.611984 -0.965134
H  0.690104 -2.600706 -1.818783
H  2.147629 -1.90577 -2.533121
H  0.758651 -0.847571 -2.092427
H  4.532457 -1.581383 2.783721
H  5.214504 -1.617172 1.150639
H  3.805375 -2.643644 1.5704
H  0.527009 3.19652 -0.482731
H  -0.159032 3.165377 1.172429
H  1.581942 3.363271 0.953184
H  -4.505492 -1.987576 0.532245
H  -5.895202 -0.914367 0.190905
H  -3.903505 -0.627361 2.419246
H  -3.762646 1.164775 2.255259
H  -5.356391 0.368708 2.054449
H  -4.226179 1.286331 -1.406362
H  -5.596131 1.416209 -0.247647
H  -4.044425 2.242243 0.107216
H  -5.123746 -0.665743 -2.230612
H  -3.735602 -1.76155 -1.897554
H  -5.399255 -2.348438 -1.764946
