program: Gaussian 09
title: TSsearch from point with gradient 239.
version: ES64L-G09RevE.01
frameworkgroup: C1[X(C24H37F5FeN2)]
method: UwB97XD
basis: Gen
operation: Freq
keyword: #PGeom=AllCheck
keyword: Guess=TCheck
keyword: SCRF=Check
keyword: GenChk
keyword: UwB97XD/ChkBas
keyword: Freq
title: TS search from point with gradient 239.
converged: YES YES YES YES
polarizability: 3.47596046e+02 9.27506389e+00 3.15483248e+02 7.89982432e+00 2.63768583e-01 2.39203291e+02
1716.lowfreq: -1252.7859 -5.1454 -0.0005 0.0004 0.0005 3.5477 12.9497 18.5595 26.4489
frequency: -1252.7842 17.8429 26.2879 32.9747 46.7020 61.4139 70.3730 72.5215 77.3355 88.3692 107.4893 121.5442 132.8593 144.6889 147.9376 151.7254 153.3680 159.7454 161.9060 174.5765 177.2852 184.7906 219.0468 229.3054 261.2501 275.9629 279.5207 282.0224 288.2207 291.9581 297.3912 300.6585 306.0005 318.1722 320.3308 322.0100 329.4651 332.6979 338.3119 345.4375 351.4653 356.0111 363.9714 370.1537 394.2735 407.8789 416.0943 419.5478 431.0691 434.2141 441.1154 454.0086 484.1842 484.8449 493.4821 500.4467 503.4126 528.3947 540.8200 568.5713 579.2243 595.8185 602.0911 609.6769 638.2477 682.5274 707.5830 735.5086 749.2337 769.4762 780.9715 783.7298 790.0353 883.9007 884.6288 885.0682 893.6945 923.8495 935.4946 938.4423 940.1440 943.1898 950.9188 952.7290 954.7759 968.0997 979.7563 983.7089 990.0160 992.5047 1011.2668 1018.5245 1019.0088 1023.0101 1042.0687 1058.6911 1068.8488 1088.0892 1088.6630 1091.5639 1092.8129 1115.4511 1123.9113 1124.9866 1171.4055 1184.5569 1223.6560 1231.1868 1238.4700 1242.3129 1249.0534 1252.5448 1271.5194 1272.5087 1282.0013 1286.6180 1291.5248 1296.8327 1297.4612 1338.9769 1342.7235 1349.6014 1375.8559 1380.8649 1381.3603 1401.2030 1405.4767 1407.0436 1411.7697 1412.8177 1414.9325 1418.3949 1425.4816 1427.5442 1435.8495 1438.7885 1445.3868 1467.7291 1487.5243 1489.3870 1491.9094 1495.0520 1495.2040 1495.7717 1500.4102 1503.1994 1505.9668 1509.2690 1511.0783 1512.9353 1516.0066 1518.5665 1518.8601 1520.3189 1524.0651 1531.0083 1532.6226 1533.6681 1541.2563 1549.0061 1564.5453 1593.8068 1655.0220 1697.6623 1709.8197 3027.1738 3034.1101 3037.6886 3045.8925 3047.2699 3053.6137 3056.7337 3066.5633 3067.9279 3070.5382 3070.7659 3076.0161 3078.3156 3082.5849 3099.2043 3101.5635 3112.2204 3115.3465 3116.2421 3122.5500 3123.9877 3126.9748 3128.6830 3133.0741 3135.8723 3139.2664 3141.5528 3146.7873 3156.4502 3158.9638 3166.4918 3174.2054 3177.2166 3181.5787 3197.1873 3203.8081
redmass: 1.0602 6.7153 6.7445 4.7321 3.5433 4.4627 4.0246 3.3999 6.7114 6.8281 5.3803 5.5768 5.3030 3.6611 2.8171 1.6548 3.3206 1.7242 2.5089 6.6962 3.0963 1.8066 1.8075 10.0379 1.7191 16.9594 7.9742 1.5423 1.9961 1.9879 2.2398 1.8717 1.2929 12.8361 1.9001 1.8840 2.3142 2.0235 1.3814 2.5198 2.3122 2.5635 2.5955 2.2251 2.1909 2.2136 2.5058 2.4420 2.0100 11.5170 2.1920 14.7275 2.3080 11.2804 2.4089 2.8571 2.9070 2.6218 3.0169 2.7069 16.9762 2.5634 2.3890 10.8455 3.9362 12.1601 11.9559 11.0061 2.8153 2.3848 2.8730 2.9900 7.2519 1.4796 2.1384 1.5649 2.1561 3.2527 1.7183 1.7432 1.9004 1.5030 8.4490 1.5358 1.5510 2.3146 1.6355 1.8402 1.6144 1.6686 1.5007 1.4559 1.3029 1.4507 1.8528 2.1108 12.0847 1.6214 1.6141 1.7442 1.7557 1.4420 3.3177 2.1447 2.0140 2.0622 2.4668 2.2664 2.2521 2.2229 3.1923 3.1385 1.6552 1.8371 2.5938 2.9122 7.6512 2.1061 2.1163 1.3413 1.7528 4.2962 7.2770 1.4716 1.4691 1.5018 1.3072 1.5548 1.4241 1.4702 1.3693 1.3005 1.3160 1.2599 1.2430 1.2393 1.2403 3.6371 1.0574 1.0736 1.0521 1.0679 1.0599 1.0604 1.0586 1.0746 1.0858 1.0630 1.0603 1.0566 1.0610 1.0669 1.0858 1.0678 1.0545 1.0625 1.0772 1.0720 1.0564 1.0575 11.7181 1.3405 1.3499 5.6328 6.2169 1.0518 1.0389 1.0455 1.0613 1.0612 1.0384 1.0427 1.0603 1.0601 1.0432 1.0632 1.0627 1.0421 1.0455 1.1021 1.0983 1.1022 1.1041 1.1001 1.1028 1.0944 1.0850 1.0988 1.0998 1.1020 1.0996 1.0998 1.1014 1.0990 1.0969 1.1030 1.1014 1.1009 1.0996 1.0964 1.0947
irintensity: 5256.2787 0.1721 0.0096 0.1058 0.0027 0.3562 0.0584 0.0216 1.4528 1.1037 5.7239 1.2417 4.5768 0.7741 0.7019 3.4136 6.4703 6.9309 6.3524 1.0591 8.9406 4.2675 0.6150 4.9501 8.7188 0.3078 1.5775 4.6243 2.2909 2.1548 4.0293 1.6410 1.2374 1.0961 0.0769 4.2535 1.2285 0.6476 0.2195 0.6695 4.2414 3.4009 4.1140 4.6391 2.6662 1.6377 0.0530 1.0995 5.5138 0.1432 7.0043 2.5529 0.4181 0.0366 0.7403 0.0562 0.5789 8.9030 19.9155 12.1807 6.7787 16.5560 0.2176 1.9794 23.0120 0.0505 0.1681 0.6686 12.7101 9.2922 2.2820 2.1160 32.0166 0.6667 16.6394 3.3525 4.7127 27.0630 2.0366 2.5508 2.1599 4.2376 307.8274 21.6005 3.0672 36.9919 3.3705 4.2407 6.0514 20.9331 4.7594 1.4335 0.5575 13.4073 16.7057 19.8440 302.4197 2.7105 2.0493 4.4791 11.9166 4.7642 10.7055 8.6750 24.6302 39.5376 40.3950 3.0882 1.6859 1.2542 7.1735 33.3767 1.5265 0.1989 25.0630 75.8912 39.5745 21.1960 66.7935 9.3013 9.9887 4.7782 19.1660 0.1221 0.2493 8.7750 1.6967 2.3556 13.9528 3.3976 0.4337 1.5066 1.4684 23.2614 12.3806 32.3495 29.4849 291.5227 0.0637 1.8023 2.0130 2.9620 1.0314 1.6316 1.2661 1.2810 4.1899 3.5313 21.7651 6.3331 0.3351 7.4302 8.8359 9.7867 1.3994 15.9297 8.8315 3.8713 4.9217 13.2464 179.2497 106.7234 38.6362 27.7588 24.1096 55.4531 13.2070 60.3387 18.2102 29.7972 24.5126 18.1254 18.3520 22.3139 22.8614 16.7228 34.9669 21.6354 27.9931 33.5402 56.6871 4.5883 55.5980 33.2767 21.2396 3.4656 30.6067 67.9964 31.3845 22.6082 8.7876 19.0026 64.2089 36.2094 25.6118 11.3217 13.5884 11.7767 7.3233 40.9932 35.7100
temp: 298.150 k
press: 1.00000 atm
elementType: 26 7 6 6 6 6 6 6 6 6 6 1 1 1 1 1 1 1 1 1 1 1 1 1 1 1 1 1 1 7 6 6 6 6 6 6 6 6 6 1 1 1 1 1 1 1 1 1 1 1 1 1 1 1 1 1 1 6 6 6 6 6 6 1 9 9 9 9 9
symmnumber: 1
zpe: 1528452.0 jmol-1
zpe.correction: 0.582157 hartree
zpe.thermalcorrener: 0.616407 hartree
zpe.thermalcorrenthalpy: 0.617351 hartree
zpe.thermalcorrgfe: 0.516832 hartree
zpe.sumelectzpe: -1668.005402 hartree
zpe.sumelectthermal: -1667.971152 hartree
zpe.sumelectthermalent: -1667.970207 hartree
zpe.sumelectthermalfe: -1668.070726 hartree
dipole: -5.1464 3.9306 0.2042
dipole: 6.4790
quadrupole: -219.6066 -204.9569 -196.1346
quadrupole: 8.9480 -2.1234 -4.3760
quadrupole: -12.7073 1.9425 10.7648 8.9480 -2.1234 -4.3760
hfenergy: -1668.5875587 hartree
pointgroup: C01 [X(C24H37F5Fe1N2)]
dipole: -2.0225599 1.5494739 0.077234 debye
polarizability: 347.6057793|9.2315886|315.4560602|8.015702|0.2194557|239.2207455 unknown
InChI: InChI=1S/C15H19F5N.C9H18N.Fe/c1-14(2)6-5-7-15(3,4)21(14)22-13-11(19)9(17)8(16)10(18)12(13)20;1-8(2)6-5-7-9(3,4)10-8;/h5-7H2,1-4H3;5-7H2,1-4H3;/q;-1;+1
charge 0 multiplicity 5
69 atoms
Fe -1.08096165 0.36880558 -0.02169868
N  -2.70219246 -0.54939784 0.0616284
C  -2.81643982 -1.78720201 0.85778595
C  -3.86592951 -0.08808109 -0.71395397
C  -4.12147012 -1.78695802 1.68069749
C  -5.14442438 -0.10981451 0.14627715
C  -5.35189987 -1.44961203 0.84505451
C  -1.64451 -1.8215914 1.85088551
C  -3.59607047 1.36257301 -1.13579095
C  -2.7206146 -3.06193156 -0.00684224
C  -4.07553872 -0.8963811 -2.01383306
H  -4.02511014 -1.03542438 2.47593469
H  -5.05893077 0.67587772 0.90896871
H  -4.23861899 -2.76122043 2.16978922
H  -6.00820503 0.14094206 -0.48118471
H  -6.23893364 -1.40601575 1.48572704
H  -5.54491381 -2.23944319 0.10921426
H  -1.71495245 -2.70022143 2.49954154
H  -4.46943769 1.7937001 -1.6349788
H  -0.67616066 -1.88714525 1.33923126
H  -2.76449293 1.41693333 -1.85210836
H  -1.65841155 -0.93600902 2.49607028
H  -3.36474054 1.98852099 -0.26496963
H  -2.5856915 -3.9425737 0.63017473
H  -4.77346681 -0.37432186 -2.6773802
H  -3.61712681 -3.23084052 -0.60496351
H  -4.48383751 -1.89135083 -1.83315324
H  -1.86645668 -2.99237024 -0.68544756
H  -3.12078679 -1.01576103 -2.53509715
N  0.39706651 1.72713541 0.00038765
C  0.55092676 2.43849921 1.30560299
C  0.63032698 2.51605117 -1.24817554
C  1.91221071 3.15852431 1.34880191
C  2.01176681 3.19325314 -1.16423659
C  2.17863456 4.01716236 0.11292272
C  0.52344639 1.3610552 2.40045205
C  0.61809462 1.51463506 -2.4128103
C  -0.60294494 3.41148644 1.60740295
C  -0.46046586 3.56515005 -1.53753442
H  2.69881812 2.40027661 1.4221891
H  2.78352157 2.41469414 -1.1878266
H  1.96564304 3.76737158 2.25885698
H  2.15937305 3.82195605 -2.05003743
H  3.19536076 4.41929062 0.16123679
H  1.50962443 4.88650775 0.09792411
H  0.73428821 1.80943008 3.37558854
H  0.82306802 2.03017804 -3.35537039
H  -0.47206114 0.9007348 2.47708384
H  -0.36737654 1.03597953 -2.51929192
H  1.26182463 0.57605385 2.21891344
H  1.36760571 0.73146584 -2.28373359
H  -0.57480095 3.69273796 2.66520547
H  -0.40787708 3.86053736 -2.59034148
H  -0.55870727 4.33227042 1.02635288
H  -0.35160831 4.4747698 -0.946912
H  -1.57113858 2.93389113 1.41399833
H  -1.45804491 3.16025825 -1.34999602
C  1.66888044 -1.42897163 -0.47449722
C  2.24755002 -0.2586452 -0.05138447
C  3.58376742 -0.3684291 0.27520843
C  4.29857083 -1.55834749 0.1927848
C  3.64990036 -2.71088942 -0.23920363
C  2.30466983 -2.65541346 -0.58269739
H  1.3469208 0.85966848 -0.0036901
F  1.66946597 -3.7570921 -0.99969613
F  4.31696973 -3.86481691 -0.32325774
F  5.59442141 -1.62244776 0.52016846
F  4.27082955 0.71953222 0.70337634
F  0.32664624 -1.40420238 -0.83263452
