program: Gaussian 09
title: fromlowest int disp from FeTS removed C6F5H.
version: ES64L-G09RevE.01
frameworkgroup: C1[X(C18H36FeN2)]
method: UwB97XD
basis: Gen
operation: Freq
keyword: #P
keyword: Geom=AllCheck
keyword: Guess=TCheck
keyword: SCRF=Check
keyword: GenChk
keyword: UwB97XD/ChkBas
keyword: Freq
title: from lowest int disp from FeTS removed C6F5H.
converged: YES YES NO NO
polarizability: 2.91184846e+02 -2.92516988e-02 2.07124648e+02 2.50244998e-01 -5.63258816e-03 2.07069167e+02
1716.lowfreq: -11.1573 -5.9054 -0.0007 -0.0006 -0.0005 11.2357 15.8216 26.1346 28.1723
frequency: 13.7114 25.2862 27.5820 58.0213 58.3234 132.5418 133.3817 134.8819 138.2781 142.7105 176.0738 180.5049 190.3601 193.1736 265.6128 271.3352 275.2523 283.5222 294.9992 298.0694 300.9827 307.1353 312.7228 316.2711 324.1034 328.6421 330.1064 346.5594 354.3502 385.2035 390.7762 415.8204 416.6071 429.9226 439.1212 481.1746 481.3995 501.8782 502.8362 523.8036 536.7932 560.5710 564.7162 598.5506 603.4317 761.6791 770.0959 777.7653 778.4833 875.7598 876.0282 887.4090 888.0495 933.2429 933.9387 936.9226 937.3833 938.6557 939.3434 966.7560 970.9434 976.8271 982.1575 987.9940 988.5992 1014.3798 1015.4525 1016.4586 1016.8414 1068.5504 1068.9669 1085.2615 1085.5392 1089.5641 1092.3719 1113.6707 1114.0583 1185.7763 1186.0859 1219.0269 1224.6794 1237.3504 1237.7831 1245.7181 1245.7536 1267.6000 1267.9984 1284.1132 1287.4660 1300.3129 1300.5777 1334.8616 1338.5970 1376.9730 1377.1504 1396.2375 1396.3782 1401.0417 1401.1189 1404.9501 1405.6424 1411.9864 1413.1208 1425.0626 1426.1049 1431.0703 1432.2510 1485.0528 1485.2443 1490.6692 1491.3226 1491.9386 1492.5154 1499.5650 1499.9549 1500.7207 1501.9356 1507.9505 1510.0561 1512.4283 1512.8600 1516.7058 1517.5546 1520.5239 1521.3949 1527.4253 1529.4007 1539.5941 1539.8151 3016.3358 3017.1774 3018.4673 3019.6531 3049.7249 3050.0217 3051.1323 3051.4491 3062.9704 3063.1024 3067.2280 3067.9520 3070.9293 3071.2669 3099.1912 3099.5185 3101.0448 3101.2338 3101.3969 3102.3421 3103.0163 3103.3424 3117.3417 3117.8738 3134.5319 3134.9248 3137.9669 3138.3482 3140.2003 3140.6775 3143.5956 3144.5863 3170.6287 3170.7384 3190.4795 3190.5772
redmass: 3.4075 3.6162 3.4784 3.9043 3.8382 2.7245 2.6758 3.8658 4.5640 5.0643 2.1421 1.5374 1.2227 1.4381 2.1948 1.1296 1.0951 1.5793 2.0324 2.0475 2.0659 1.8528 1.4625 1.3289 1.6209 2.2820 1.9768 1.5809 1.8636 2.1673 2.1371 2.4595 2.4651 1.9498 2.2258 2.3538 2.3743 2.8726 2.8583 3.0395 3.4981 2.7956 2.4030 2.4285 2.6840 2.4199 2.3624 2.7925 2.7935 1.5111 1.5088 2.2427 2.2574 1.7614 1.7740 1.5358 1.5329 1.5875 1.6423 2.0760 1.7316 1.8919 2.1465 1.6844 1.8551 1.2865 1.2904 1.4863 1.4812 2.0306 2.0296 1.6571 1.6564 1.8006 1.8657 1.4196 1.4154 1.9256 1.9211 2.4434 2.3777 2.2700 2.2546 3.2700 3.2726 1.9003 1.9087 2.5766 2.5468 2.2563 2.2590 1.3388 1.3837 1.4807 1.4827 1.5804 1.5645 1.4688 1.4811 1.3112 1.3035 1.3895 1.3810 1.2377 1.2380 1.2417 1.2396 1.0829 1.0846 1.0516 1.0670 1.0616 1.0574 1.0704 1.0677 1.0546 1.0541 1.0526 1.0545 1.0864 1.0833 1.0543 1.0551 1.0554 1.0556 1.0740 1.0710 1.0567 1.0566 1.0466 1.0463 1.0454 1.0451 1.0599 1.0600 1.0609 1.0611 1.0403 1.0399 1.0430 1.0455 1.0596 1.0622 1.1000 1.1003 1.0933 1.0953 1.0945 1.0932 1.0961 1.0966 1.1043 1.1042 1.1023 1.1023 1.1020 1.1017 1.1017 1.1014 1.1016 1.1014 1.0996 1.0996 1.0950 1.0950
irintensity: 0.0063 0.0045 0.0024 0.0027 0.0086 0.2051 0.1908 1.5006 3.9667 3.5425 7.0807 4.3617 1.5437 3.4628 8.2166 0.6819 0.6040 0.6382 3.3116 0.7162 0.3977 0.7822 1.1337 1.2299 3.8822 0.0192 0.0886 0.6089 9.8851 0.4573 5.3983 0.0396 0.0462 0.0620 11.0444 0.0780 0.0799 0.0330 0.1907 3.7986 40.9054 9.7648 8.4590 0.0113 3.2554 1.4994 14.9190 1.2667 1.1663 0.0184 0.0210 2.5158 4.7131 0.1583 0.5771 1.2407 1.8113 1.2605 1.4224 3.0349 54.7642 2.5280 46.4633 2.6380 73.6042 0.1775 0.2084 3.4161 1.0813 9.0917 9.8350 3.0199 3.0444 1.0473 19.7979 3.2541 3.1148 38.1041 38.2403 73.3644 4.3275 0.9905 0.8928 6.4690 5.7371 0.0960 0.7011 136.8354 1.7055 60.4470 61.6685 33.5347 1.8236 0.0176 0.3496 4.1479 4.5058 3.8999 3.7330 1.5242 1.0805 14.9213 26.4042 18.6045 18.0052 8.8753 8.9246 1.7950 1.9088 0.4408 0.6818 0.5240 0.4208 0.1993 0.4118 5.3724 0.8359 12.1025 11.8795 7.6200 5.1042 15.2081 4.6499 8.4746 8.6461 5.6540 4.3141 7.1708 4.6545 35.5045 5.8203 66.7149 19.5382 21.8182 20.2163 36.8704 36.3803 24.1080 24.1343 24.0235 23.1457 48.3374 17.6850 28.2541 50.8143 29.0925 58.2746 22.8103 12.6353 18.7306 31.4874 58.7431 57.6837 5.0302 5.3446 16.9866 14.8360 85.4355 68.3192 85.7391 40.4719 22.6474 22.9152 67.9196 5.6769
temp: 298.150 k
press: 1.00000 atm
elementType: 26 7 6 6 6 6 6 6 6 6 6 1 1 1 1 1 1 1 1 1 1 1 1 1 1 1 1 1 1 7 6 6 6 6 6 6 6 6 6 1 1 1 1 1 1 1 1 1 1 1 1 1 1 1 1 1 1
symmnumber: 1
zpe: 1373041.6 jmol-1
zpe.correction: 0.522964 hartree
zpe.thermalcorrener: 0.547634 hartree
zpe.thermalcorrenthalpy: 0.548578 hartree
zpe.thermalcorrgfe: 0.467927 hartree
zpe.sumelectzpe: -939.867718 hartree
zpe.sumelectthermal: -939.843048 hartree
zpe.sumelectthermalent: -939.842104 hartree
zpe.sumelectthermalfe: -939.922755 hartree
dipole: -0.0048 -0.2819 0.0438
dipole: 0.2853
quadrupole: -142.8350 -142.2834 -142.3419
quadrupole: -0.1050 -0.9181 -0.0020
quadrupole: -0.3482 0.2033 0.1449 -0.1050 -0.9181 -0.0020
hfenergy: -940.3906817 hartree
pointgroup: C01 [X(C18H36Fe1N2)]
dipole: 0.0514687 0.0515414 0.0854046 debye
polarizability: 246.2665036|-41.8488862|251.804733|2.8861045|-3.0414556|207.3074246 unknown
InChI: InChI=1S/2C9H18N.Fe/c2*1-8(2)6-5-7-9(3,4)10-8;/h2*5-7H2,1-4H3;/q2*-1;+2
charge 0 multiplicity 5
57 atoms
Fe -1.09682144 -0.99685198 0.16470323
N  0.19083287 -2.35569277 0.19665457
C  1.61618864 -2.01386762 0.27275907
C  -0.22339271 -3.7623121 0.12848927
C  2.33936398 -2.89136062 1.31445788
C  0.5299954 -4.60770275 1.17540728
C  2.03878394 -4.3773179 1.13325281
C  1.70305857 -0.54883417 0.72938198
C  -1.72425704 -3.80639728 0.45714489
C  2.32987495 -2.10357577 -1.09381462
C  -0.05257297 -4.37326632 -1.27976906
H  2.00162293 -2.5875792 2.31436538
H  0.16316785 -4.32707899 2.17179552
H  3.41916384 -2.704655 1.26776859
H  0.2941726 -5.66903435 1.03122161
H  2.52911688 -4.95804118 1.92196478
H  2.45458113 -4.73874452 0.1847658
H  2.7434375 -0.22177687 0.824314
H  -2.1063794 -4.83197901 0.43199454
H  1.22763445 0.12221984 -0.00305593
H  -2.3085818 -3.23413431 -0.28083768
H  1.21549111 -0.4155079 1.70213255
H  -1.91737283 -3.39698588 1.45540778
H  3.32916181 -1.65718592 -1.03911974
H  -0.54804424 -5.34872822 -1.34065587
H  2.4508177 -3.13206992 -1.43727105
H  0.9942146 -4.52257899 -1.54865658
H  1.74802144 -1.56485297 -1.84849851
H  -0.49781919 -3.70860521 -2.02673499
N  -2.41551543 0.32921312 0.07117225
C  -3.03635251 0.83679016 1.300553
C  -2.84906919 0.8424424 -1.23355773
C  -3.12695219 2.37619858 1.27438754
C  -2.94325985 2.38144479 -1.21681953
C  -3.73856038 2.90209008 -0.02191427
C  -2.12613528 0.42440926 2.46817939
C  -1.77874907 0.43273975 -2.2580122
C  -4.42599364 0.21968758 1.57174133
C  -4.18520428 0.22921119 -1.7069834
H  -2.11043085 2.78115822 1.36799512
H  -1.92462937 2.7883435 -1.16145007
H  -3.69620907 2.72671887 2.14393333
H  -3.38087242 2.73447297 -2.15854104
H  -3.73811188 3.99740264 -0.01960566
H  -4.78929979 2.59730348 -0.10002002
H  -2.52608139 0.77249793 3.42598669
H  -2.02344844 0.80268897 -3.25892217
H  -2.04701731 -0.67202667 2.54037295
H  -1.70438775 -0.66307233 -2.33597637
H  -1.12152855 0.84539311 2.34654381
H  -0.79814291 0.83538276 -1.97850477
H  -4.7706753 0.47171414 2.58095582
H  -4.37413355 0.47641911 -2.75765409
H  -5.18510504 0.57092363 0.87106457
H  -5.03939619 0.58649477 -1.12974737
H  -4.3690761 -0.86990213 1.48400622
H  -4.14611184 -0.86020001 -1.60695383
