program: Gaussian 09
title: removing the second imaginary freq from TS, fix CH, NH, from disp_f2.
version: ES64L-G09RevE.01
frameworkgroup: C1[X(C28H45CoF5N2O)]
method: UwB97XD
basis: Gen
operation: Freq
keyword: #P
keyword: Geom=AllCheck
keyword: Guess=TCheck
keyword: SCRF=Check
keyword: GenChk
keyword: UwB97XD/ChkBas
keyword: Freq
converged: YES YES YES YES
polarizability: 3.99610003e+02 -1.98224407e+01 3.66398791e+02 1.80804205e+01 -2.30982161e+00 2.90138562e+02
1716.lowfreq: -1291.7575 -10.0632 -0.0007 -0.0003 -0.0002 5.0664 9.3874 17.9152 23.7041
frequency: -1291.7497 17.1354 23.3615 31.1561 37.3971 46.2473 59.4802 61.8812 65.4120 67.1635 78.3101 83.6930 86.0630 88.1502 98.0763 101.8047 108.6369 119.7091 135.5543 140.6968 144.3632 150.9517 156.6807 164.6997 172.0542 174.4150 198.4733 199.9912 226.1016 244.3310 254.2437 267.4836 268.8891 275.8034 280.1850 282.1872 285.5130 292.5450 297.6786 298.3414 307.5472 312.5332 317.5754 319.3934 325.0479 329.2539 335.6749 341.9195 352.3900 357.5894 361.6180 369.0240 389.9143 408.1505 415.3258 418.3024 429.8937 431.9418 437.2681 452.4239 485.6304 493.0378 495.2266 502.7316 517.8616 529.9543 545.5573 562.0636 578.8692 595.7908 601.7784 609.0930 629.5050 638.2026 681.3312 702.2443 706.5829 735.5472 749.9714 770.5630 783.7103 794.3296 798.9219 806.6711 881.5810 883.8081 885.2841 895.2670 901.9650 927.1906 932.8926 934.3659 938.3771 943.4721 945.2979 946.8285 950.8919 952.0037 957.9960 967.2802 972.8396 977.3996 982.9723 988.7042 989.6552 994.1227 1010.5821 1016.4693 1018.0881 1022.7636 1042.2075 1064.7940 1072.2717 1087.8380 1087.9949 1089.3649 1091.6664 1095.0411 1113.2341 1118.7193 1126.1464 1154.8094 1168.3216 1172.9840 1194.6858 1223.5408 1231.2046 1237.2343 1240.1733 1241.5980 1243.5123 1249.6017 1252.1504 1262.8916 1267.2599 1269.0121 1279.9753 1287.4128 1293.9746 1296.7883 1299.4029 1308.9712 1328.0661 1336.1594 1341.8828 1348.6616 1355.8125 1377.0501 1381.6177 1382.9633 1390.6387 1395.9072 1402.6069 1404.1076 1407.2411 1408.3943 1411.4378 1418.1525 1420.6174 1423.6911 1426.3983 1429.3769 1437.8907 1444.4388 1467.0519 1486.9836 1487.7101 1490.3952 1493.4425 1494.8203 1496.2715 1497.8418 1500.3884 1502.3978 1504.4487 1506.0804 1511.5231 1513.2458 1514.1325 1515.2418 1519.2435 1520.0387 1521.1687 1523.0136 1526.0335 1528.0603 1529.8611 1534.3406 1541.6772 1546.0274 1549.5582 1565.5465 1594.1589 1641.2449 1697.6359 1711.3861 3012.8843 3027.1923 3032.5247 3044.0942 3055.5336 3062.5223 3063.5893 3064.2293 3067.4320 3069.4751 3071.5326 3072.7343 3073.9275 3077.5787 3082.7193 3083.2191 3088.7715 3101.8073 3106.1992 3111.8879 3118.8052 3119.2159 3125.5794 3125.8698 3133.5138 3134.3440 3134.5154 3135.6987 3136.8669 3141.0522 3142.2123 3142.8773 3146.9171 3151.6909 3154.2681 3159.1408 3159.6542 3166.2742 3168.8002 3174.5982 3179.8205 3181.0586 3192.2430 3199.7186
redmass: 1.0604 7.0035 9.4949 6.0046 4.1449 4.6085 3.8284 4.1152 3.9451 2.9203 3.0101 4.0462 5.9567 4.5357 4.6574 3.4405 7.6917 2.7987 9.2916 5.1103 4.2318 2.7220 4.3982 2.6335 8.1977 2.6698 1.1076 1.0906 12.7767 2.0511 1.9676 1.5272 2.0565 14.7972 8.9697 1.6728 1.6298 1.6881 1.7748 1.7571 2.3618 2.0894 2.0177 4.5744 1.9628 2.0290 1.4425 2.3468 2.7755 3.8985 3.1583 1.9903 2.2634 2.1784 2.4242 2.4340 1.9405 11.4340 2.1347 14.6503 11.5946 2.2965 2.9459 2.9437 2.6595 2.5089 2.6929 3.2417 16.2748 2.5967 2.4742 10.5272 2.0599 3.9723 12.1621 5.1793 11.9390 10.6990 2.6977 2.3872 2.9674 7.6593 2.6510 1.2160 1.4961 1.7976 1.7352 2.1834 1.7160 3.0721 3.0774 1.9615 1.8991 1.4898 1.5547 1.5035 2.3931 3.3471 2.1315 1.9808 2.6009 1.5846 2.1529 1.6095 1.6505 1.7065 1.4249 1.3566 1.4749 1.3728 1.9565 1.9737 11.7037 1.7428 1.7617 1.7057 1.7327 1.9059 1.3962 1.4551 12.1925 4.4902 2.1011 1.9755 1.9859 2.4135 2.3434 1.3961 2.3369 2.2148 3.0287 1.1973 3.1870 1.2643 1.8720 1.6711 2.5782 2.7242 8.6675 2.0680 1.1628 2.2380 1.3735 1.3413 1.6945 4.3193 1.2329 7.1796 1.4573 1.4734 1.3021 1.5701 1.5234 1.5937 1.3522 1.3491 1.4056 1.3527 1.3657 1.2992 1.2370 1.2467 1.2372 1.2361 3.5934 1.0557 1.0663 1.0667 1.0633 1.0635 1.0593 1.0683 1.0729 1.0710 1.0826 1.0729 1.0579 1.0689 1.0680 1.0703 1.0684 1.0671 1.0560 1.0614 1.0844 1.0659 1.0806 1.0823 1.0558 1.1045 1.0574 11.5929 1.2642 1.3860 6.6373 6.3797 1.0715 1.0478 1.0439 1.0696 1.0392 1.0603 1.0407 1.0395 1.0415 1.0614 1.0632 1.0601 1.0447 1.0620 1.0627 1.0435 1.0634 1.0625 1.0979 1.1007 1.0998 1.1033 1.0884 1.1004 1.1024 1.0994 1.0984 1.1011 1.1006 1.0995 1.1011 1.0957 1.0982 1.1039 1.0988 1.1003 1.0980 1.1036 1.1023 1.1011 1.1006 1.0998 1.0981 1.0951
irintensity: 5596.6134 0.2852 0.0355 0.1381 0.5468 0.0909 0.5741 0.2390 0.1265 0.6199 1.5019 2.1850 0.5536 1.2249 7.4508 3.5035 5.0199 6.3182 0.8303 5.3165 4.1833 0.3722 0.5346 0.5285 0.6281 9.3750 0.1717 0.3339 5.1549 0.5781 5.3459 2.7490 4.5878 0.1042 0.1520 0.2334 1.2327 0.0357 1.4831 7.8255 1.6753 0.2259 0.7816 1.3281 1.2899 2.9557 0.4137 0.6656 2.4950 1.4829 3.5121 2.4509 4.9390 1.6831 0.0431 0.0261 2.3823 0.0545 3.3094 2.8883 0.6084 0.3697 0.1585 0.1024 5.6635 4.2029 14.9253 27.1275 5.1231 11.2474 0.1903 2.1026 0.8719 16.8726 0.0334 4.1338 0.1649 0.5520 10.1255 3.5605 1.8380 16.3369 0.8240 2.1324 0.1287 7.1437 5.2609 0.9000 6.1340 20.5871 6.4791 1.7348 1.4574 1.7685 1.8846 2.9048 118.1781 205.0896 2.1810 8.9516 24.3522 4.6023 7.5522 5.4872 6.7798 19.2890 0.9045 2.4501 10.3113 7.4771 12.5818 5.2926 330.9536 0.4458 2.1395 3.3144 1.1596 3.4272 1.5423 3.2795 18.4769 61.1431 15.0230 26.8097 27.0585 41.1109 7.5946 12.0837 3.1969 0.1922 13.9702 2.9108 30.2592 2.1810 0.5602 0.1931 30.9967 65.9364 44.7575 32.3582 1.9769 40.5398 4.5551 7.1102 8.3255 6.0210 1.5190 19.1175 0.2636 0.1686 1.0146 5.4571 2.6130 2.0292 0.8634 1.4226 3.1666 9.8904 8.8408 3.3343 12.0045 34.6611 6.6488 30.1331 299.7546 1.7100 1.0143 1.6594 2.7391 0.1435 1.3767 6.1434 5.1276 3.4778 3.1120 6.6673 12.7577 3.0665 10.8292 8.5184 2.1395 13.0250 2.4252 4.8013 4.2148 10.6695 9.6085 3.1196 4.2830 2.5885 10.3346 173.6431 87.5483 68.0691 28.9813 27.8852 70.3482 57.9231 3.3241 85.8898 23.3958 23.1635 19.0498 7.0236 27.2223 15.1837 20.0782 38.7917 22.0479 35.9194 52.0726 21.2237 8.3557 22.9881 20.2001 38.2658 28.0081 27.8603 55.2540 14.5713 17.4819 8.3189 15.8854 5.6677 14.1835 77.2876 40.1796 18.7284 36.3225 24.6102 23.8734 36.5594 25.8606 33.6125 15.7767 8.4971 9.5335 10.4670 35.3119 38.0047
temp: 298.150 k
press: 1.00000 atm
elementType: 7 6 6 6 6 6 6 6 6 6 1 1 1 1 1 1 1 1 1 1 1 1 1 1 1 1 1 1 7 6 6 6 6 6 6 6 6 6 1 1 1 1 1 1 1 1 1 1 1 1 1 1 1 1 1 1 6 6 6 6 6 6 1 9 9 9 9 9 27 6 8 6 6 6 1 1 1 1 1 1 1 1
symmnumber: 1
zpe: 1845206.1 jmol-1
zpe.correction: 0.702802 hartree
zpe.thermalcorrener: 0.743327 hartree
zpe.thermalcorrenthalpy: 0.744271 hartree
zpe.thermalcorrgfe: 0.629301 hartree
zpe.sumelectzpe: -1921.925228 hartree
zpe.sumelectthermal: -1921.884702 hartree
zpe.sumelectthermalent: -1921.883758 hartree
zpe.sumelectthermalfe: -1921.998729 hartree
dipole: 5.2768 3.4843 1.8397
dipole: 6.5855
quadrupole: -262.3877 -233.9321 -226.9050
quadrupole: -0.5828 -3.2788 -0.2865
quadrupole: -21.3127 7.1428 14.1699 -0.5828 -3.2788 -0.2865
hfenergy: -1922.6280297 hartree
pointgroup: C01 [X(C28H45Co1F5N2O1)]
dipole: -1.8421863 1.8018151 -0.2698979 debye
polarizability: 408.8991875|11.1443532|359.7381678|1.6528097|4.5273357|287.5100002 unknown
InChI: InChI=1S/C15H19F5N.C9H18N.C4H8O.Co/c1-14(2)6-5-7-15(3,4)21(14)22-13-11(19)9(17)8(16)10(18)12(13)20;1-8(2)6-5-7-9(3,4)10-8;1-2-4-5-3-1;/h5-7H2,1-4H3;5-7H2,1-4H3;1-4H2;/q;-1;;+1
charge 0 multiplicity 4
82 atoms
N  -2.66555143 -0.55790207 -0.02984026
C  -2.82348673 -1.74866537 0.82976265
C  -3.77858025 -0.15365609 -0.90810424
C  -4.20433482 -1.77039387 1.51684216
C  -5.11971282 -0.17451337 -0.15260862
C  -5.36184635 -1.49809338 0.56354843
C  -1.7549164 -1.67506023 1.92958187
C  -3.49478947 1.28376873 -1.36304088
C  -2.59706211 -3.05699572 0.04282766
C  -3.85867153 -1.01877694 -2.18455701
H  -4.22835642 -0.9982649 2.29239062
H  -5.10757092 0.62544977 0.59821894
H  -4.33318407 -2.73538774 2.02040303
H  -5.93241088 0.04904518 -0.85392543
H  -6.29674761 -1.44978682 1.12989879
H  -5.4744263 -2.31440271 -0.16002981
H  -1.83362791 -2.53772572 2.59813298
H  -4.32758763 1.68244347 -1.95061584
H  -0.73808326 -1.68556304 1.51691401
H  -2.60815826 1.32537466 -2.01231656
H  -1.88461177 -0.7723876 2.53458014
H  -3.33911952 1.94617442 -0.50259496
H  -2.52061358 -3.90107254 0.7363094
H  -4.52731079 -0.55112071 -2.91539991
H  -3.41673046 -3.27438955 -0.64345358
H  -4.23729116 -2.02298915 -1.99255331
H  -1.67221465 -3.00160759 -0.53621849
H  -2.86485148 -1.11454841 -2.63321355
N  0.3880334 1.70509975 -0.05205621
C  0.47317227 2.48290931 1.21721481
C  0.6950708 2.43473547 -1.31760955
C  1.83678689 3.1966673 1.30659944
C  2.0769005 3.10602505 -1.19187004
C  2.18328904 3.99278341 0.04898529
C  0.37068579 1.47077568 2.36751399
C  0.74783675 1.38196772 -2.43598135
C  -0.68116926 3.48807069 1.39016198
C  -0.36380996 3.47915472 -1.72629617
H  2.61183506 2.43915276 1.46406559
H  2.84054741 2.32072043 -1.13144965
H  1.84206548 3.85002792 2.18695564
H  2.28141133 3.68630073 -2.09946394
H  3.20148778 4.38532963 0.13418095
H  1.52734791 4.86647563 -0.04687647
H  0.51036994 1.97393264 3.32914419
H  1.01893862 1.85224536 -3.38564347
H  -0.62152403 1.00312738 2.39091229
H  -0.2319306 0.90312325 -2.58537501
H  1.12520579 0.6848443 2.28336197
H  1.4806722 0.6011273 -2.22335071
H  -0.72968788 3.82059081 2.43266748
H  -0.25951889 3.71018425 -2.79135933
H  -0.57168131 4.37904125 0.7722729
H  -0.26727138 4.42100068 -1.18598957
H  -1.63956525 3.01951112 1.14051709
H  -1.37681659 3.10420018 -1.55997819
C  1.60686498 -1.48651027 -0.29876482
C  2.18644939 -0.3115987 0.11029322
C  3.48968393 -0.43644215 0.54656591
C  4.17210614 -1.64765663 0.58115819
C  3.52459349 -2.80458984 0.1588926
C  2.21232095 -2.73275622 -0.2921622
H  1.3468868 0.80615758 0.04732283
F  1.57771519 -3.83787084 -0.70038692
F  4.16059599 -3.97827512 0.18776481
F  5.43581952 -1.72762219 1.01262462
F  4.17131077 0.65449751 0.971849
F  0.29859584 -1.44547205 -0.7630167
Co -1.08329884 0.35762647 -0.1571705
C  -5.82719203 2.21980622 2.82412145
O  -5.54572453 0.96441323 3.42949252
C  -4.25578674 1.06828311 4.00540356
C  -3.43755424 1.82941401 2.96598353
C  -4.46667908 2.83134704 2.40897683
H  -6.49599386 2.03202011 1.98059855
H  -6.34620103 2.87006493 3.54154697
H  -4.30112735 1.62279385 4.95640312
H  -3.89554921 0.05711161 4.20972054
H  -2.55518057 2.31230833 3.39140268
H  -3.11131311 1.14385863 2.17553874
H  -4.33640564 3.82322297 2.84957287
H  -4.38322736 2.94136177 1.32450557
