program: Gaussian 09
title: search for lowest int, from FeTS disp replacing Fe with Co.
version: ES64L-G09RevE.01
frameworkgroup: C1[X(C28H45CoF5N2O)]
method: UwB97XD
basis: Gen
operation: Freq
keyword: #P
keyword: Geom=AllCheck
keyword: Guess=TCheck
keyword: SCRF=Check
keyword: GenChk
keyword: UwB97XD/ChkBas
keyword: Freq
title: #p opt freq uwb97xd/gen guess=read pseudo=read scf=xqc
basis: NPDir=0 NMtPBC= 1 NCelOv= 1 NCel= 1 NClECP= 1 NCelD= 1
basis: NCelK= 1 NCelE2= 1 NClLst= 1 CellRange= 0.0.
basis: One-electron integrals computed using PRISM.
converged: YES YES NO NO
polarizability: 3.24231984e+02 -1.59943202e+01 4.09777327e+02 1.15793310e+01 -9.20785350e+00 3.16936411e+02
1716.lowfreq: -17.0011 -0.0006 -0.0004 0.0007 3.8419 4.9414 15.8061 16.8570 25.5384
frequency: 12.6306 16.2580 25.4530 29.7483 36.1978 40.6304 45.4995 52.4964 59.6845 61.8624 68.0797 71.0285 74.6482 81.3417 93.0163 102.9133 113.9675 119.4447 138.5940 146.0335 148.7246 151.7325 159.2952 165.2707 177.3683 198.0532 202.8667 211.5957 221.1133 225.2448 241.0802 264.2011 266.5656 274.8559 276.4275 291.2231 298.6611 301.0735 303.6039 305.8067 306.8863 308.9139 312.5574 328.1022 330.9362 333.1505 333.5082 341.3853 341.9001 345.7779 359.1272 381.0523 388.7630 417.3986 419.7595 420.9697 428.5343 436.4337 442.4274 480.4674 482.8172 489.7572 501.2296 505.1097 528.2019 540.9158 549.1786 579.2624 583.5125 587.6216 598.5964 602.3157 611.1544 681.7377 692.3352 697.1142 705.1473 730.9655 757.4924 766.7326 778.6738 784.4341 854.2386 877.5514 878.1291 887.2159 888.7042 891.3974 913.2871 931.1669 933.7895 934.2847 936.6591 936.8483 938.9435 946.3769 949.2227 955.8031 956.6156 969.1921 973.5606 977.5120 981.3033 989.1793 990.8746 994.9454 1011.3298 1014.3858 1015.8443 1020.0591 1058.7333 1059.5933 1066.3506 1086.0550 1089.4097 1090.0896 1092.6749 1104.6098 1113.3903 1119.6587 1153.6390 1178.5798 1186.1146 1187.5285 1189.3259 1210.1251 1216.6638 1222.7943 1231.3649 1236.5321 1237.6262 1238.8371 1241.9881 1247.0624 1267.5339 1268.3970 1272.7634 1281.7987 1284.4879 1287.2595 1298.7373 1303.2721 1322.7134 1333.3532 1335.3396 1335.5141 1342.6078 1374.1215 1381.7548 1383.7349 1393.1335 1400.0985 1400.3989 1405.7886 1407.2848 1408.1776 1411.5665 1414.4221 1416.5874 1424.0515 1426.9244 1429.0692 1433.5064 1434.1671 1457.2800 1485.8647 1487.2541 1490.0104 1490.7261 1491.7392 1491.8318 1493.8717 1502.0656 1503.8791 1506.1966 1507.4218 1509.8399 1511.0097 1511.6296 1513.6404 1516.6091 1518.2170 1522.1656 1523.8301 1527.3570 1528.6949 1530.5086 1535.8842 1541.7791 1548.1831 1560.2573 1574.7854 1594.1502 1714.6275 1717.1485 3024.0441 3033.1192 3044.3535 3048.2903 3054.6034 3055.5241 3059.0027 3059.8988 3061.5840 3061.7956 3063.0311 3064.5204 3065.3918 3065.9921 3070.5909 3070.8662 3074.1661 3091.6734 3103.2027 3104.3008 3105.1051 3106.6782 3108.4615 3110.4196 3118.5476 3120.9354 3125.3311 3125.9305 3130.7361 3133.4717 3135.3929 3135.8133 3138.1374 3142.6613 3142.8410 3148.4249 3156.8083 3157.1072 3165.8028 3171.7398 3177.2823 3182.8166 3187.6046 3187.8167 3238.2249
redmass: 5.8021 8.5878 5.4826 5.8632 7.1076 8.7002 5.0239 6.9590 4.0062 4.1344 3.6379 5.2141 4.9095 4.0796 3.7756 3.3486 3.4458 3.5310 14.8137 2.1238 2.5037 2.6180 3.8644 15.3005 2.8961 3.0216 1.1201 1.1025 8.3056 5.2058 1.0680 1.4778 1.5601 16.4354 18.4660 1.6059 2.0960 2.1293 1.3443 1.9619 1.7357 12.9359 2.1507 1.3368 2.4730 2.3262 12.3562 5.8972 1.6112 1.6188 1.3400 2.2384 2.3093 2.4199 2.4757 8.9512 2.0067 2.2146 14.5950 14.2037 2.3416 2.5196 2.9293 2.7389 2.8518 3.1846 3.0491 2.7287 4.0013 16.6860 2.3942 2.5770 1.8761 12.1344 3.8801 10.3568 5.7080 9.5848 2.4681 2.4452 2.8188 2.7250 1.4230 1.5193 1.4958 1.7050 1.7321 2.2202 1.9047 1.7177 1.7977 1.8644 1.6168 1.8007 1.5093 3.0816 1.5210 2.3278 2.4395 2.1390 1.7929 2.0463 6.2730 1.7187 1.6853 1.3448 1.3620 1.3915 1.3657 1.3700 2.0600 1.8073 2.0650 1.7818 1.6376 1.6712 1.7936 12.0060 1.4401 1.4644 6.8669 7.1092 2.0034 1.8530 1.9561 1.4380 2.4527 2.4179 1.3386 1.8694 1.8957 2.3332 3.0972 3.2243 1.5551 1.4924 1.5604 2.5395 2.3431 1.3036 2.1068 2.1960 11.2006 10.7978 1.3065 1.3574 1.3536 1.2740 1.4678 1.4624 1.3111 1.5108 1.5366 1.2927 1.3071 1.5124 1.3509 1.4383 1.4063 1.3344 1.2509 1.2551 1.2428 1.2595 8.2011 1.0793 1.0790 1.0726 1.0543 1.0581 1.0706 1.0623 1.0689 1.0744 1.0578 1.0599 1.0627 1.0618 1.0680 1.0915 1.0736 1.0679 1.0635 1.0674 1.0610 1.0880 1.0711 1.0572 1.0554 1.0877 1.1022 11.7560 6.4723 11.4283 9.9250 1.0705 1.0395 1.0642 1.0418 1.0434 1.0559 1.0603 1.0398 1.0515 1.0504 1.0565 1.0515 1.0455 1.0488 1.0541 1.0640 1.0510 1.0709 1.1015 1.1005 1.0973 1.1005 1.1016 1.1035 1.1040 1.1031 1.0952 1.0952 1.1013 1.1014 1.1004 1.0994 1.1008 1.1007 1.1012 1.0990 1.0966 1.1045 1.1007 1.0993 1.1002 1.0980 1.0956 1.0999 1.0947
irintensity: 0.1218 0.1525 0.1278 0.1609 0.1797 0.2639 0.0784 0.4525 0.2425 0.5255 0.9455 0.1680 5.4745 2.0019 0.6491 1.5951 0.3219 2.2972 0.0189 4.4341 1.8692 0.4509 0.2741 0.7562 1.3326 11.4798 1.5053 0.7820 6.6511 5.7053 0.3077 6.0582 4.2685 0.1162 0.0954 1.8296 1.0147 0.3264 1.5910 1.4467 1.9611 0.7648 0.8382 0.6598 3.9092 0.4735 2.9046 0.6296 0.4560 3.9861 3.0753 0.7287 16.8245 0.3429 0.0776 0.0774 0.1221 8.9000 0.1875 0.6696 0.2383 0.0655 1.2225 0.5120 1.4441 73.1854 17.0381 11.3057 2.5964 0.1385 0.0629 5.3351 1.1178 0.0241 3.8769 0.0723 1.7493 27.8470 4.1541 11.5200 0.6020 2.4827 1.8777 0.1844 0.0444 38.9433 17.6340 2.5988 6.8659 1.9589 8.6116 1.6689 1.1134 4.1382 0.8281 4.3613 4.8465 21.4505 53.6742 30.6692 15.9753 31.3749 155.3176 3.7092 19.4507 1.8489 1.4456 5.2915 0.0584 1.2864 4.2460 7.6656 14.9616 6.6057 4.3114 3.8284 7.5342 169.7988 2.6935 1.9515 86.7503 0.7906 16.2105 5.1940 47.1613 3.1840 103.0711 9.5797 3.2647 37.8265 23.5670 4.9002 21.5404 4.3779 1.9687 2.0273 0.3213 125.5391 4.0860 10.0203 21.4228 69.3747 13.7049 4.0173 19.5681 3.0167 6.5006 0.7140 0.0501 0.0877 0.1837 9.1035 1.8499 1.4180 5.1193 1.0482 5.8488 13.7823 3.3628 10.2623 10.8169 14.7761 7.0075 10.5903 7.7148 0.1379 1.4679 0.8088 0.6378 1.6861 1.1500 0.2387 0.7418 0.8445 6.4666 7.2424 3.8978 17.9895 6.8642 5.5144 5.6479 1.7654 1.4096 5.0284 13.5629 2.6938 9.9546 2.8461 6.9671 0.9355 4.3179 207.4439 338.4542 34.6213 0.9417 61.0348 29.2794 32.8482 27.5625 5.7147 24.9521 29.5970 13.2695 26.8888 21.1702 23.4336 30.6259 6.5524 38.1580 39.3473 30.4341 43.8014 12.6714 24.6111 54.5204 59.9330 28.7528 70.4602 20.7381 49.6175 37.4613 26.7948 15.9253 7.0865 54.5398 20.2890 22.9257 93.0674 21.6445 56.8856 7.0982 28.9038 33.4660 19.4792 19.0810 5.2647 16.3778 55.7060 24.6968 40.1772
temp: 298.150 k
press: 1.00000 atm
elementType: 7 6 6 6 6 6 6 6 6 6 1 1 1 1 1 1 1 1 1 1 1 1 1 1 1 1 1 1 7 6 6 6 6 6 6 6 6 6 1 1 1 1 1 1 1 1 1 1 1 1 1 1 1 1 1 1 6 6 6 6 6 6 1 9 9 9 9 9 27 6 8 6 6 6 1 1 1 1 1 1 1 1
symmnumber: 1
zpe: 1853678.7 jmol-1
zpe.correction: 0.706029 hartree
zpe.thermalcorrener: 0.747448 hartree
zpe.thermalcorrenthalpy: 0.748392 hartree
zpe.thermalcorrgfe: 0.629056 hartree
zpe.sumelectzpe: -1921.941145 hartree
zpe.sumelectthermal: -1921.899726 hartree
zpe.sumelectthermalent: -1921.898782 hartree
zpe.sumelectthermalfe: -1922.018117 hartree
dipole: 1.0203 1.4591 -0.9135
dipole: 2.0011
quadrupole: -247.2267 -232.9258 -232.6295
quadrupole: -5.6675 -8.2207 2.3785
quadrupole: -9.6327 4.6682 4.9645 -5.6675 -8.2207 2.3785
hfenergy: -1922.6471735 hartree
pointgroup: C01 [X(C28H45Co1F5N2O1)]
dipole: 0.408211 0.5740916 -0.3515547 debye
polarizability: 323.8392717|-15.3440908|410.2034967|11.3993671|-8.5104446|316.9029533 unknown
InChI: InChI=1S/2C9H18N.C6HF5.C4H8O.Co/c2*1-8(2)6-5-7-9(3,4)10-8;7-2-1-3(8)5(10)6(11)4(2)9;1-2-4-5-3-1;/h2*5-7H2,1-4H3;1H;1-4H2;/q2*-1;;;+2
charge 0 multiplicity 4
82 atoms
N  1.0824167 -1.2086703 0.76459617
C  0.59042898 -2.35977841 -0.00559838
C  2.07944921 -1.44459181 1.82553208
C  1.76258022 -3.23604084 -0.49505649
C  3.22887911 -2.33978341 1.31938822
C  2.73169822 -3.60319571 0.62442331
C  -0.14694058 -1.81787377 -1.23461148
C  2.68867022 -0.08089722 2.1910026
C  -0.41368482 -3.21747142 0.79741575
C  1.45861176 -2.02369613 3.11368592
H  2.30945685 -2.67450125 -1.26406601
H  3.83584271 -1.75753818 0.6146596
H  1.36522849 -4.13735156 -0.97727993
H  3.88419586 -2.59652745 2.16047021
H  3.58141459 -4.16101039 0.21539579
H  2.24780032 -4.2739432 1.34470973
H  -0.51530771 -2.63743157 -1.85992028
H  3.49342267 -0.19392094 2.92378967
H  -1.00986014 -1.20909282 -0.93890229
H  1.94765655 0.5905554 2.64734205
H  0.51895908 -1.20165702 -1.84857881
H  3.12503619 0.40448636 1.30771913
H  -1.0320018 -3.82142264 0.12425745
H  2.18137852 -1.98184699 3.93591214
H  0.0760071 -3.90809421 1.48633817
H  1.15531499 -3.06515197 2.99992889
H  -1.06371901 -2.56891645 1.3882935
H  0.57333859 -1.44434303 3.3940526
N  -0.04978426 2.28445979 0.37714059
C  -0.00870052 2.8950308 -0.96399549
C  -0.24108295 3.15840072 1.54682388
C  -1.16645374 3.89042123 -1.16463886
C  -1.38543391 4.16578331 1.30278155
C  -1.26491267 4.90202888 -0.02721607
C  -0.16234537 1.76178553 -1.98793761
C  -0.65320694 2.27613871 2.73385714
C  1.34184658 3.58618982 -1.2725541
C  1.04743921 3.90478601 1.96055129
H  -2.10582131 3.32477298 -1.2170897
H  -2.33672878 3.61516414 1.31065445
H  -1.04775998 4.39800441 -2.1293894
H  -1.42638547 4.87596254 2.13703885
H  -2.13337072 5.55225356 -0.17620208
H  -0.38799527 5.56084474 -0.02115022
H  -0.20281231 2.15603185 -3.00828028
H  -0.86446274 2.88941449 3.61609592
H  0.69469958 1.07401861 -1.95306236
H  0.14027733 1.57286566 3.01274337
H  -1.07475834 1.18902813 -1.80975736
H  -1.54669313 1.69361078 2.49749186
H  1.42775885 3.80143758 -2.34372362
H  0.9212861 4.37776507 2.94065622
H  1.46835896 4.53064931 -0.74167718
H  1.32855075 4.68709933 1.25407008
H  2.17046097 2.92944597 -0.98518779
H  1.88064365 3.19677211 2.02529842
C  -3.15006694 -0.66577249 0.98033034
C  -3.08428503 0.38147134 0.07548988
C  -3.59102594 0.17615478 -1.19770447
C  -4.12440503 -1.04747353 -1.58172746
C  -4.16962025 -2.08633941 -0.65977878
C  -3.69301135 -1.89603772 0.63134197
H  -2.60063631 1.31724522 0.33877269
F  -3.75860628 -2.88966165 1.51525644
F  -4.68093162 -3.26307025 -1.01086699
F  -4.59435564 -1.23209909 -2.81467693
F  -3.56739085 1.16744224 -2.09611852
F  -2.68222507 -0.51117057 2.22244335
Co 0.66033407 0.56715521 0.49762768
C  5.03735814 -1.55040303 -1.97804957
O  5.39420573 -0.59376886 -0.97804932
C  4.71590793 0.62917465 -1.22720844
C  3.44032976 0.23156925 -1.9591436
C  3.95383269 -0.90065073 -2.85383019
H  5.92812024 -1.82474363 -2.55347449
H  4.66742645 -2.44761915 -1.46794457
H  4.54610671 1.12061557 -0.26496138
H  5.3364333 1.29195753 -1.84912937
H  2.70716744 -0.15767793 -1.24050536
H  2.99137876 1.05731889 -2.51675109
H  3.173197 -1.60822062 -3.14395472
H  4.39190065 -0.48900017 -3.76852792
