program: Gaussian 09
title: from lowest int disp from FeTS removed C6F5H, replacing Fe with Co.
version: ES64L-G09RevE.01
frameworkgroup: C1[X(C22H44CoN2O)]
method: UwB97XD
basis: Gen
operation: Freq
keyword: #PGeom=AllCheck
keyword: Guess=TCheck
keyword: SCRF=Check
keyword: GenChk
keyword: UwB97XD/ChkBas
keyword: Freq
converged: YES YES NO YES
polarizability: 3.93357006e+02 -5.38472462e+00 2.56954146e+02 -1.03219731e+01 -5.91739979e-01 2.33574674e+02
1716.lowfreq: -9.9874 0.0001 0.0006 0.0009 1.7991 9.2188 15.7719 19.7577 25.4813
frequency: 15.4573 18.0778 24.5590 36.1787 39.5166 58.4528 61.1735 71.4196 91.8725 92.8752 102.6963 103.4224 135.9946 136.3591 153.4141 159.4667 166.3217 190.1394 201.0065 215.6902 238.4445 257.5620 265.0936 289.2989 290.0096 291.4397 298.7116 304.3641 306.9922 312.3905 314.6376 329.7954 332.2538 338.2086 345.2230 361.7991 368.6676 385.1504 399.4221 418.4323 420.3075 434.3322 442.3379 480.8661 489.6749 502.8923 507.1300 533.1840 543.3153 564.1768 572.9437 603.4427 605.6738 659.2288 662.3703 766.7510 774.0773 778.6357 783.8992 818.3136 877.8511 883.5840 884.0075 890.7468 893.0861 924.6902 931.8340 934.7107 937.5358 940.6773 942.7966 945.2262 958.7788 964.5869 969.5842 971.6867 982.0535 987.1430 989.1617 991.5996 993.6699 1013.0179 1013.8217 1018.1121 1018.9842 1061.9423 1067.0854 1072.7027 1089.5660 1090.3768 1091.0477 1093.1302 1113.2325 1115.9657 1154.1481 1166.4585 1188.8425 1192.7233 1219.5562 1226.1491 1235.1633 1236.9676 1239.3547 1244.3844 1247.5876 1251.1620 1267.9931 1271.8279 1274.8592 1281.7030 1285.1893 1292.3398 1301.5204 1304.8530 1329.2629 1330.2574 1337.9746 1342.1891 1381.9547 1385.0087 1385.2269 1399.7938 1399.9979 1401.2555 1401.6863 1404.5447 1410.1137 1410.8394 1411.1392 1418.7619 1422.9284 1423.8522 1429.3752 1431.5520 1487.6970 1488.1097 1492.2163 1494.5056 1495.8571 1499.2008 1499.7496 1502.0263 1502.9449 1506.8339 1507.2128 1512.0007 1515.0208 1515.4885 1517.3305 1518.7376 1520.4422 1523.2185 1526.2032 1527.2657 1530.9827 1531.2417 1538.1045 1539.5084 1548.4427 1551.7583 3025.5764 3029.6729 3031.8394 3037.6875 3043.7667 3045.5333 3046.2591 3047.3652 3048.9471 3051.2910 3061.5267 3064.1629 3064.9823 3067.2297 3068.1433 3076.9156 3095.1799 3097.0336 3100.5045 3101.5486 3102.9645 3108.7157 3111.5321 3113.9045 3118.0717 3124.3996 3127.0990 3127.6724 3134.0381 3135.1680 3139.5498 3140.4371 3141.5484 3142.4655 3142.9817 3144.5857 3145.3145 3152.6245 3155.1558 3167.8654 3171.4609 3171.9218 3187.3284 3188.8598
redmass: 4.5152 4.3027 3.4283 3.3549 3.4794 3.6727 5.6091 3.9463 3.9994 3.3673 3.0201 4.3260 1.7333 2.4082 2.5452 3.6655 2.6752 1.1084 2.4677 3.7785 1.2096 2.1914 1.0846 1.6297 1.2653 1.8074 1.9143 2.0341 2.0634 1.6974 2.1848 2.4514 2.0072 1.7502 1.5604 1.2888 1.5187 2.2199 1.9561 2.3799 2.3913 1.9388 2.1675 2.3320 2.5074 2.9202 2.7626 3.0685 3.8472 2.8477 2.7183 2.3867 2.3982 2.4067 2.6658 2.4080 2.3618 2.8253 2.7698 1.4595 1.4960 1.5065 1.5081 2.1715 2.2078 3.1532 1.5822 1.6822 1.8625 1.5041 1.5563 1.5790 2.2443 2.3004 2.4012 1.8390 1.9411 1.8398 2.2640 1.6803 1.6472 1.3247 1.4069 1.3661 1.4247 2.0841 2.0750 1.8929 1.7773 1.6667 1.6734 1.7633 1.4242 1.4350 3.5119 2.4247 2.0332 1.9748 2.5183 2.4057 1.4681 2.0861 2.2735 3.2383 3.1795 1.1376 1.8865 1.8109 1.1456 2.5452 2.5937 1.4100 2.0898 2.1212 1.3336 1.2310 1.3019 1.3412 1.4434 1.4520 1.2937 1.3873 1.4336 1.3245 1.4933 1.3653 1.4784 1.4566 1.5053 1.3455 1.2370 1.2402 1.2554 1.2431 1.0804 1.0703 1.0500 1.0714 1.0706 1.0512 1.0613 1.0613 1.0815 1.0574 1.0730 1.0561 1.0647 1.0745 1.0608 1.0758 1.0550 1.0602 1.0524 1.0790 1.0839 1.0797 1.0620 1.0836 1.0581 1.1046 1.0701 1.0422 1.0707 1.0393 1.0398 1.0612 1.0601 1.0619 1.0593 1.0380 1.0410 1.0398 1.0557 1.0420 1.0481 1.0651 1.1007 1.0629 1.1020 1.1015 1.0974 1.0655 1.0947 1.1042 1.0981 1.1005 1.1000 1.1007 1.1029 1.1004 1.1013 1.1019 1.1003 1.1013 1.1013 1.1011 1.1007 1.0953 1.0996 1.1020 1.1033 1.0996 1.0956 1.0956
irintensity: 0.0823 0.0901 0.5097 0.1479 0.2118 0.1540 0.5556 0.1327 0.1255 1.2972 0.6402 0.7030 0.1609 0.0273 0.0429 0.4736 1.4252 0.5627 5.1256 8.9043 0.4379 10.3640 0.4412 5.8668 0.4424 9.1609 0.4243 0.8159 1.1294 1.4754 1.9928 0.0969 0.0330 2.6116 3.7803 0.2951 3.8578 8.6957 6.6613 0.1608 0.1355 0.4465 9.8713 0.0600 0.4127 0.0860 0.2872 7.5904 54.8434 8.6943 7.0492 0.9597 0.8247 7.2719 0.3123 2.7144 12.8188 0.7035 1.7114 3.9267 0.4178 0.0585 1.4813 0.5241 9.3829 7.4227 1.9514 1.7254 1.1011 9.0403 4.9778 1.7402 1.9140 22.7559 101.9485 23.5485 19.3717 5.0394 46.5053 9.3646 24.9050 0.7780 1.9503 1.1490 5.5526 1.8091 15.3531 5.7514 3.0657 3.8994 3.4801 10.4730 3.2093 3.7401 43.7303 22.9586 15.7327 60.2589 151.9023 10.8819 3.4919 0.9589 0.7354 12.6194 7.7315 6.7117 2.0139 0.7209 5.2808 144.2061 16.2722 6.5469 12.8173 90.1111 2.3080 2.1494 30.8112 3.0533 0.2832 0.4841 0.8943 14.7015 4.5901 1.8346 1.1194 3.6608 5.7171 11.6633 5.9006 5.2294 8.3764 21.6736 9.5246 11.2252 0.8236 1.2366 1.1200 1.5960 0.5866 0.6335 0.4114 4.3590 2.4195 5.0886 4.6964 7.5331 3.4048 6.6147 3.1289 7.7351 0.9004 16.7873 9.8916 4.3798 1.4025 10.3760 4.8243 16.9613 7.1559 2.0887 42.8903 27.4424 80.1692 28.7816 6.5690 17.2364 22.8017 36.0416 34.5543 19.8830 20.7658 28.0934 17.2565 21.4006 43.7441 40.7479 44.4039 36.0969 45.2351 31.8090 61.3362 22.6306 19.4065 53.1011 21.5519 4.6344 33.6100 41.5629 31.3751 13.4376 19.1744 17.4299 14.9963 32.1757 81.4248 119.9212 3.9706 20.5497 29.7832 24.4379 66.1928 20.8129 48.6491 37.1435
temp: 298.150 k
press: 1.00000 atm
elementType: 7 6 6 6 6 6 6 6 6 6 1 1 1 1 1 1 1 1 1 1 1 1 1 1 1 1 1 1 7 6 6 6 6 6 6 6 6 6 1 1 1 1 1 1 1 1 1 1 1 1 1 1 1 1 1 1 27 6 8 6 6 6 1 1 1 1 1 1 1 1
symmnumber: 1
zpe: 1691836.4 jmol-1
zpe.correction: 0.644386 hartree
zpe.thermalcorrener: 0.675223 hartree
zpe.thermalcorrenthalpy: 0.676167 hartree
zpe.thermalcorrgfe: 0.580273 hartree
zpe.sumelectzpe: -1193.775194 hartree
zpe.sumelectthermal: -1193.744357 hartree
zpe.sumelectthermalent: -1193.743413 hartree
zpe.sumelectthermalfe: -1193.839307 hartree
dipole: -1.9623 -0.1940 0.2516
dipole: 1.9879
quadrupole: -196.8318 -168.1022 -174.7414
quadrupole: -1.2996 6.9489 -0.0983
quadrupole: -16.9400 11.7896 5.1504 -1.2996 6.9489 -0.0983
hfenergy: -1194.4195801 hartree
pointgroup: C01 [X(C22H44Co1N2O1)]
dipole: -0.7362399 0.2354074 -0.1191263 debye
polarizability: 364.8337274|-59.1177541|270.462137|15.5673021|5.4400414|248.5899611 unknown
InChI: InChI=1S/2C9H18N.C4H8O.Co/c2*1-8(2)6-5-7-9(3,4)10-8;1-2-4-5-3-1;/h2*5-7H2,1-4H3;1-4H2;/q2*-1;;+2
charge 0 multiplicity 4
70 atoms
N  0.93571259 -1.28960919 0.11698321
C  1.44931632 -2.04306095 -1.04007769
C  1.70470099 -1.30309367 1.36968067
C  2.94887616 -1.76060937 -1.2630851
C  3.20528691 -1.04883928 1.10992238
C  3.76888623 -1.93849543 0.00833187
C  0.69243299 -1.54595326 -2.28189206
C  1.18442119 -0.1675079 2.25818878
C  1.19894276 -3.56447306 -0.93994377
C  1.51231849 -2.61648889 2.16066426
H  3.05535113 -0.72360408 -1.60803502
H  3.32865127 0.00035231 0.81054566
H  3.32532767 -2.40911895 -2.06343822
H  3.76666056 -1.18353617 2.04347078
H  4.81849117 -1.68858736 -0.1823916
H  3.7563245 -2.98790872 0.32427984
H  1.10408393 -1.98722361 -3.19524633
H  1.74371603 -0.12216541 3.19825449
H  -0.36605372 -1.83239633 -2.24947382
H  0.1271062 -0.31756398 2.51567558
H  0.77215731 -0.45528668 -2.37691217
H  1.29578947 0.79709689 1.75218996
H  1.38087817 -4.04826589 -1.9060967
H  1.90778786 -2.51442597 3.17775985
H  1.84466582 -4.05108417 -0.20677067
H  2.0179411 -3.46611464 1.69826743
H  0.16126173 -3.75129741 -0.64688378
H  0.44665037 -2.85547725 2.2259083
N  -2.46663214 0.13688504 -0.04107644
C  -2.73134691 1.39392835 0.67827657
C  -3.60072433 -0.64223364 -0.55857255
C  -3.76941681 2.25616193 -0.06890587
C  -4.62740776 0.2597146 -1.27538195
C  -5.02323699 1.47450444 -0.44297576
C  -1.41474637 2.18494602 0.71484193
C  -3.05249129 -1.64058957 -1.58515788
C  -3.17206292 1.17732262 2.14321772
C  -4.29879176 -1.46932005 0.54441273
H  -3.30398785 2.62883536 -0.99121458
H  -4.17901839 0.61126044 -2.21424261
H  -4.01996982 3.13125513 0.54282013
H  -5.50982395 -0.33426265 -1.54174549
H  -5.7095238 2.1129149 -1.00946452
H  -5.56563525 1.16393234 0.45831406
H  -1.55470296 3.16342811 1.18523132
H  -3.86184563 -2.2267093 -2.03227246
H  -0.65238843 1.66363427 1.30846969
H  -2.36242958 -2.3534661 -1.11145047
H  -1.0330594 2.34684689 -0.2997214
H  -2.52695797 -1.11457577 -2.3892558
H  -3.16223272 2.12560476 2.69248003
H  -5.00170552 -2.18362367 0.10115662
H  -4.1797957 0.76657803 2.22233184
H  -4.86358795 -0.84978334 1.24283762
H  -2.4874983 0.48169269 2.63917215
H  -3.55068307 -2.02620982 1.11707811
Co -0.70925903 -0.45878572 -0.08946415
C  5.96845733 -5.00008558 0.78125546
O  6.95165868 -4.32912681 1.54992388
C  6.24576363 -3.40768506 2.36299657
C  4.97755874 -4.14635723 2.82051305
C  4.78052544 -5.22884773 1.73269347
H  5.6683942 -4.3735318 -0.07274532
H  6.41392216 -5.92056097 0.39962484
H  6.90483743 -3.10876786 3.18014722
H  5.98331236 -2.51316676 1.77755039
H  5.12896948 -4.60597493 3.80002173
H  4.12313922 -3.47014246 2.89686837
H  4.81859392 -6.2297063 2.1688766
H  3.82236854 -5.13319478 1.21326807
