program: Gaussian 09
title: ts search rm -freq.
version: ES64L-G09RevE.01
frameworkgroup: C1[X(C25H27CoF10NO)]
method: UwB97XD
basis: Gen
operation: Freq
keyword: #P
keyword: Geom=AllCheck
keyword: Guess=TCheck
keyword: SCRF=Check
keyword: GenChk
keyword: UwB97XD/ChkBas
keyword: Freq
converged: YES YES YES YES
polarizability: 3.66914931e+02 -4.20933669e+00 2.97311502e+02 -3.21807383e+00 1.58409707e+01 2.54049146e+02
1716.lowfreq: -1356.2622 -31.0524 0.0003 0.0005 0.0007 1.7942 9.2415 17.2412 20.0512
frequency: -1356.2585 14.8685 19.6230 28.5018 30.6932 35.7865 44.2736 51.3769 66.5021 73.7749 78.8622 81.0917 83.5819 107.1768 117.7488 124.0168 132.7476 142.5049 144.8059 146.7854 157.1794 160.5895 162.2919 168.1260 171.2226 182.4405 208.4388 226.6097 227.4374 236.0043 250.3395 275.3812 276.6764 277.0574 280.1054 281.7074 296.3396 305.3113 310.0938 313.2756 320.3674 325.0477 334.9844 338.7520 352.1347 357.4477 358.2462 366.8503 376.5457 397.5714 409.4291 420.7375 427.3607 434.7699 437.1223 451.5047 451.7698 485.5633 494.0814 494.9556 501.0546 536.5339 577.5333 585.3600 587.7451 595.9223 609.3741 634.6970 646.2480 680.9426 687.3999 691.8298 703.3380 723.4649 734.9657 747.6030 751.9854 779.1645 792.4398 795.0922 862.3386 884.5938 891.3444 895.5187 905.9808 925.0152 939.1420 942.7561 948.3663 950.6791 953.1307 956.4028 981.4659 984.1194 996.1564 1000.0171 1018.5083 1031.6931 1037.8222 1068.0882 1072.2812 1085.4872 1089.5910 1095.6343 1096.0381 1122.6414 1127.4587 1152.0202 1173.0108 1177.6257 1206.9198 1222.9042 1233.6422 1243.6596 1252.3215 1270.6891 1277.4419 1284.4690 1288.5424 1296.1305 1298.0397 1307.2694 1333.1090 1339.4250 1344.6149 1349.6470 1372.3395 1374.8287 1382.8200 1393.7153 1397.3342 1410.5071 1412.0739 1416.8834 1421.7548 1430.4706 1444.2612 1451.9546 1465.9710 1492.9442 1498.5849 1499.9497 1500.9913 1507.1088 1512.4202 1512.8665 1513.9773 1520.5418 1524.0934 1528.1098 1533.9712 1536.5709 1539.6812 1547.4326 1551.1918 1556.5429 1566.4734 1568.2825 1638.9102 1689.9111 1698.1823 1701.9837 1711.3671 3057.6233 3065.5479 3067.8457 3069.6172 3074.9859 3075.8915 3079.8291 3083.3779 3097.6538 3102.2956 3105.0579 3111.1234 3115.2998 3126.4661 3141.2596 3143.8152 3148.6264 3152.2045 3164.8791 3165.3365 3169.0081 3180.3122 3186.6451 3189.2524 3194.9216 3207.3746
redmass: 1.0540 8.6303 11.9537 9.5069 6.5725 6.5235 7.8417 4.8909 4.5064 4.8811 3.2477 4.3062 11.9287 9.1828 9.3599 5.2520 14.3212 3.0754 4.3049 3.7870 4.2808 2.5472 6.2473 1.3942 14.6608 9.7703 7.1752 2.0402 10.9195 10.2859 6.5915 4.8820 16.1115 18.5702 12.6894 13.1044 1.9066 2.2665 2.4759 11.4575 6.2090 2.4442 2.3944 1.5498 6.9153 6.8549 2.4147 3.5171 10.9426 1.5797 1.5862 2.4473 12.3122 2.1486 8.3216 15.8911 15.5947 11.5942 2.2932 13.2125 3.1505 2.5283 17.1492 16.9936 1.8034 2.5589 10.5640 11.0480 4.2174 12.0352 12.1683 3.1190 11.9200 12.0142 10.9167 11.8067 2.9137 3.1340 13.6583 7.3253 1.6921 1.4774 2.2069 2.1102 3.1504 3.1289 1.9898 1.8066 8.0110 2.4771 1.5228 1.5441 9.5806 1.7302 1.6299 1.5005 1.8968 1.4279 1.4546 1.8978 6.0918 6.0220 1.6079 8.8527 1.7835 1.4703 11.2478 13.3487 1.9729 1.7595 1.3899 1.3513 2.3334 2.0850 3.1479 1.6958 1.1724 2.1363 1.3849 9.4519 2.0125 12.5963 11.8795 1.3608 2.0223 3.0173 5.6822 1.4209 1.4699 1.5712 4.7238 1.6236 1.4331 1.3302 1.2961 1.2876 1.2348 1.2545 3.0182 1.0686 1.0620 1.0676 1.0912 1.0834 1.1022 3.1645 1.3917 1.0819 1.0761 1.0744 1.0754 1.0783 1.0812 1.0784 1.0876 1.2321 9.3497 12.1599 1.5398 12.0267 6.2405 12.0170 5.9034 1.0618 1.0459 1.0496 1.0414 1.0557 1.0440 1.0479 1.0693 1.0642 1.0654 1.0617 1.1004 1.1029 1.1045 1.0993 1.1016 1.1004 1.1012 1.1026 1.1028 1.1042 1.1067 1.1000 1.0995 1.0995 1.0948
irintensity: 5526.7008 0.4909 0.7269 0.5562 0.3418 1.3157 0.2194 0.6589 0.3047 0.2758 0.1283 0.5430 0.0964 3.5995 1.4590 1.0462 0.0232 1.6903 1.8192 1.1818 1.5208 1.3637 1.1176 1.6542 1.0369 3.1055 39.8341 1.2767 2.1735 4.3197 17.7561 18.6773 0.9519 0.2323 3.0565 1.5580 1.4958 0.5999 6.3159 0.4916 3.5372 0.1925 0.5502 2.0359 0.4186 6.6749 1.3752 2.3925 12.4557 2.6562 0.8291 0.0359 0.0044 5.8000 0.3107 1.3410 1.9989 1.1494 0.3144 2.3252 0.1079 11.3908 7.6528 0.2206 0.9370 9.9352 2.6678 12.5490 16.4933 0.0320 0.0112 10.5750 0.2031 4.3168 0.9934 0.7863 15.0484 2.0661 9.7511 14.1645 11.7773 0.4511 21.1207 23.3529 72.9825 22.7907 4.0464 15.0176 283.4449 10.1538 0.2066 1.0918 174.5045 18.4662 7.6670 0.2991 7.2977 6.2291 4.3018 25.4558 300.6300 136.4097 1.9083 184.7936 30.0001 2.6395 26.2921 6.6438 24.2075 0.7605 5.1068 9.1194 9.8490 0.3765 28.5271 0.5112 0.8707 17.5347 14.6043 63.3363 25.3253 29.0849 2.1034 0.1562 8.4592 8.3813 12.8499 3.8708 0.1604 5.1057 25.8691 1.4177 0.4804 2.1867 6.9095 6.3653 26.6813 42.5590 245.1994 1.9814 2.1941 5.7743 6.2213 1.9256 11.2015 309.1456 110.2466 16.9249 12.0644 9.0337 15.0447 34.7951 0.2125 25.5313 4.9208 50.0277 202.8744 190.5874 73.7690 6.8518 34.3519 48.9122 21.6704 22.0222 9.0121 22.1004 7.0887 18.8032 20.5315 23.4626 33.4778 20.3364 9.3353 19.3499 37.2783 25.1616 38.5282 6.8123 14.2956 42.0555 33.0135 15.3165 15.8621 10.4363 15.1311 11.0225 15.4253 2.6919 32.9549
temp: 298.150 k
press: 1.00000 atm
elementType: 27 7 6 6 6 6 6 6 6 6 6 1 1 1 1 1 1 1 1 1 1 1 1 1 1 1 1 1 1 6 6 6 6 6 6 1 9 9 9 9 9 6 6 6 6 6 6 9 9 9 9 9 8 6 1 1 6 1 1 6 1 1 6 1 1
symmnumber: 1
zpe: 1290210.1 jmol-1
zpe.correction: 0.491415 hartree
zpe.thermalcorrener: 0.529514 hartree
zpe.thermalcorrenthalpy: 0.530458 hartree
zpe.thermalcorrgfe: 0.418773 hartree
zpe.sumelectzpe: -2241.283801 hartree
zpe.sumelectthermal: -2241.245702 hartree
zpe.sumelectthermalent: -2241.244758 hartree
zpe.sumelectthermalfe: -2241.356443 hartree
dipole: -0.7698 -0.4788 3.9816
dipole: 4.0835
quadrupole: -275.9360 -215.1688 -222.2043
quadrupole: -0.9990 -2.1511 -17.5278
quadrupole: -38.1663 22.6009 15.5654 -0.9990 -2.1511 -17.5278
hfenergy: -2241.7752159 hartree
pointgroup: C01 [X(C25H27Co1F10N1O1)]
dipole: -0.1854393 0.002128 1.5958184 debye
polarizability: 364.967637|8.4564543|301.783688|-12.9892762|7.0710511|251.5242541 unknown
InChI: InChI=1S/C15H19F5N.C6F5.C4H8O.Co/c1-14(2)6-5-7-15(3,4)21(14)22-13-11(19)9(17)8(16)10(18)12(13)20;7-2-1-3(8)5(10)6(11)4(2)9;1-2-4-5-3-1;/h5-7H2,1-4H3;;1-4H2;
charge 0 multiplicity 4
65 atoms
Co 0.69828293 0.31445243 0.21572553
N  -0.63011856 1.73599344 -0.1182921
C  -0.55861363 2.26539369 -1.51927819
C  -0.89612084 2.72548148 0.9697812
C  -1.82172627 3.09438841 -1.81654353
C  -2.1407631 3.56406501 0.6158855
C  -2.06948122 4.18335943 -0.77668555
C  -0.52603795 1.06443284 -2.47850905
C  -1.20174687 1.93295398 2.2485948
C  0.71314177 3.09039765 -1.80227517
C  0.30760386 3.63265707 1.28534134
H  -2.68413159 2.41526495 -1.82989729
H  -3.02025211 2.91093102 0.66487506
H  -1.73665135 3.52615461 -2.82055
H  -2.27211752 4.34058825 1.37837264
H  -3.00619368 4.70441175 -0.99884551
H  -1.28005189 4.94300498 -0.82096767
H  -0.51139104 1.42468117 -3.51104101
H  -1.51759386 2.61758807 3.04116853
H  0.37775382 0.45653688 -2.34829057
H  -0.31128431 1.40603465 2.60891323
H  -1.40042788 0.42197362 -2.36338453
H  -2.00813401 1.21193675 2.09063429
H  0.82834432 3.21284211 -2.88392483
H  0.14777244 4.12501847 2.25015527
H  0.68771106 4.08870007 -1.36724947
H  0.4618462 4.41888688 0.54674555
H  1.60231977 2.57649371 -1.42509575
H  1.22952457 3.04770204 1.35551873
C  3.5933081 0.9272057 0.50274442
C  2.65772335 0.27960202 -0.2859413
C  3.16748493 -0.34280368 -1.41291128
C  4.51346391 -0.32885342 -1.75751464
C  5.40979376 0.34053294 -0.93364871
C  4.94965849 0.97639399 0.21372002
H  -1.63782694 0.87295336 -0.12083156
F  5.81377306 1.6128338 1.01066412
F  6.70707276 0.36850194 -1.23894993
F  4.95949892 -0.9461672 -2.85539784
F  2.33428372 -1.01674947 -2.237693
F  3.18508666 1.54673888 1.6380472
C  -1.9017663 -1.44376587 -0.38097683
C  -2.49373474 -0.22772631 -0.14473221
C  -3.8569448 -0.27923652 0.06165643
C  -4.58818372 -1.46252767 0.03786014
C  -3.92724289 -2.6636783 -0.20171412
C  -2.55358702 -2.66559496 -0.41428619
F  -1.90591313 -3.81689992 -0.62866727
F  -4.60785863 -3.81100131 -0.22107017
F  -5.90821973 -1.47418393 0.24374082
F  -4.54527807 0.85773672 0.30831679
F  -0.52289955 -1.48167896 -0.57701017
O  0.69134944 -0.82545945 1.99666776
C  1.77976272 -1.78746938 2.1014213
H  2.00099249 -2.15193631 1.09402998
H  2.65169467 -1.2610665 2.49264213
C  -0.47500162 -1.32496777 2.69631559
H  -0.50580683 -0.85272657 3.68443156
H  -1.35924847 -1.03151687 2.13101955
C  1.25834558 -2.89708774 3.00838043
H  1.68455854 -3.86660744 2.74488771
H  1.50083011 -2.68801437 4.05474992
C  -0.25512114 -2.8235039 2.78730875
H  -0.83229107 -3.27717596 3.59521482
H  -0.53371365 -3.305885 1.84510033
