program: Gaussian 09
title: 000046039
version: EM64L-G09RevD.01
frameworkgroup: C1[X(C12H19N2O2)]
method: RPBEPBE
basis: SDD
operation: Freq
keyword: #p
keyword: freq=noraman
keyword: PBEPBE/SDD
title: #p freq=noraman PBEPBE/SDD
converged: YES YES NO NO
title: Mulliken charges:
elementType: O O N N C C C C C C C C C C C C H H H H H H H H H H H H H H H H H H H
charge: -0.319725 -0.285727 -0.233738 -0.358321 -0.300268 0.568424 -0.609929 -0.560586 -0.681435 -0.438120 -0.384609 0.327730 -0.201947 -0.394006 0.312264 -0.601034 0.275385 0.248559 0.280255 0.263645 0.271261 0.274862 0.254326 0.285010 0.268233 0.236914 0.256455 0.313083 0.265209 0.259264 0.284039 0.350311 0.251422 0.251112 0.271680
chargesum: 1.00000
title: Mulliken charges with hydrogens summed into heavy atoms:
elementType: O O N N C C C C C C C C C C C C
charge: -0.319725 -0.285727 -0.233738 -0.008010 0.223676 0.568424 0.205234 0.253612 0.080167 -0.125037 -0.119400 0.327730 0.057317 -0.109967 0.312264 0.173180
polarizability: 2.00875319e+02 3.58367106e+00 1.51530306e+02 -4.02988319e+00 4.79254543e+00 9.64893692e+01
1716.lowfreq: -6.6908 -5.0197 0.0003 0.0006 0.0007 9.0677 26.1370 39.4220 63.0264
frequency: 25.8337 39.4117 62.9833 72.8174 91.2019 91.4756 128.9900 171.4985 188.1192 205.2700 218.7801 239.1179 255.4725 288.2028 318.6342 331.0553 339.2749 345.8001 364.2524 392.3736 440.2041 464.9505 486.0410 531.6016 593.8495 615.0734 628.4895 656.2755 677.9811 690.8338 695.0774 762.8562 792.1699 800.1317 832.5390 881.5605 905.6413 914.1171 925.4590 959.8000 985.5546 989.1614 1009.8546 1053.7961 1066.8471 1085.4717 1109.9220 1112.5808 1113.7798 1125.1620 1149.2542 1168.1191 1175.4202 1192.0730 1206.1869 1218.7915 1230.4649 1306.8034 1308.9932 1356.8033 1391.8460 1407.1729 1422.5968 1434.6708 1436.5573 1445.2997 1456.4922 1459.1299 1467.2808 1473.6082 1475.9223 1479.7600 1481.1815 1485.6217 1489.9523 1503.7393 1514.7999 1582.4229 1619.8928 1717.2721 3000.7056 3007.8185 3027.7070 3034.4752 3037.1815 3087.6582 3096.9051 3103.2604 3123.1800 3129.8540 3142.3515 3147.0102 3158.7511 3163.4458 3165.2239 3172.9907 3184.3857 3194.3059 3562.9857
redmass: 3.5406 4.6832 4.2724 2.8724 3.3622 1.1338 2.0559 3.2814 2.8533 1.1013 1.8774 4.6890 1.6427 4.0030 2.0682 2.9959 4.0823 1.7395 2.7889 3.2225 3.0073 3.5161 3.0856 3.0167 6.8559 3.2499 1.2839 6.7360 8.1681 2.5391 5.1866 2.6962 1.4999 1.2383 4.3053 3.1299 1.4938 2.1948 1.9075 2.3102 5.8638 1.3367 1.9167 5.8434 1.5422 1.6925 1.5557 1.6664 1.4443 1.2898 1.6951 1.9141 2.2363 1.2798 1.7072 1.6844 2.6441 1.3288 1.2867 1.2834 6.7713 1.1989 1.1466 1.6532 1.4459 1.2163 1.0953 1.2727 1.1029 1.1407 1.0538 1.8518 1.0417 1.0493 1.0791 1.0610 1.4065 6.7478 6.7123 9.3646 1.0348 1.0371 1.0337 1.0536 1.0399 1.1033 1.1008 1.0996 1.1041 1.1002 1.1054 1.1047 1.1046 1.0897 1.1039 1.0923 1.0935 1.0978 1.0776
irintensity: 0.1424 10.0218 2.6975 0.3262 4.5374 0.7553 0.1842 0.6563 3.9145 0.1561 1.4461 0.0776 0.2765 3.7088 2.1114 19.9904 0.4252 1.2842 4.2072 3.9128 2.5603 1.3003 1.9408 0.7675 0.9996 31.5677 84.6568 4.0157 17.5559 57.9004 3.6957 11.8272 37.5049 12.9370 44.5137 42.5177 11.0579 42.8157 57.8952 35.1486 6.6215 0.8471 22.2131 251.3148 1.0312 11.7680 14.1438 4.7539 19.1140 0.0449 126.7750 60.1586 239.6458 81.5481 1.7295 0.2075 17.7215 18.7218 30.5367 3.2596 39.8219 22.1979 28.7807 35.9553 35.3097 5.9239 10.1838 164.6506 2.6178 4.3601 11.5441 208.1313 18.4201 42.0835 24.7855 37.6719 151.8642 48.9496 102.2850 312.8123 40.7077 3.5867 2.4751 9.2307 7.4921 18.6389 3.3328 3.6249 19.5517 2.8294 0.9056 13.0721 5.4237 2.2584 2.6102 29.8305 0.9268 0.8909 73.1055
temp: 298.150 k
press: 1.00000 atm
elementType: 8 8 7 7 6 6 6 6 6 6 6 6 6 6 6 6 1 1 1 1 1 1 1 1 1 1 1 1 1 1 1 1 1 1 1
symmnumber: 1
zpe: 781614.1 jmol-1
zpe.correction: 0.297701 hartree
zpe.thermalcorrener: 0.314954 hartree
zpe.thermalcorrenthalpy: 0.315898 hartree
zpe.thermalcorrgfe: 0.252122 hartree
zpe.sumelectzpe: -727.162684 hartree
zpe.sumelectthermal: -727.145431 hartree
zpe.sumelectthermalent: -727.144487 hartree
zpe.sumelectthermalfe: -727.208263 hartree
dipole: 5.6060 -0.8755 -0.6650
dipole: 5.7128
quadrupole: -24.0205 -77.3350 -88.6744
quadrupole: -8.3174 -4.6843 1.2612
quadrupole: 39.3228 -13.9917 -25.3311 -8.3174 -4.6843 1.2612
hfenergy: -727.4603853 hartree
pointgroup: C01 [X(C12H19N2O2)]
dipole: 2.2220969 0.1321026 0.3105182 debye
polarizability: 200.1508036|-7.7215181|147.3455679|3.1627445|16.349881|101.3986227 unknown
InChI: InChI=1S/C12H19N2O2/c1-5-14(3,4)10-7-6-8-11(9-10)16-12(15)13-2/h6-9,13H,5H2,1-4H3
charge 1 multiplicity 1
35 atoms
O  -2.243864 -0.703809 -0.271481
O  -2.1275 1.546225 0.550762
N  2.541438 0.496867 0.554021
N  -4.152085 0.476033 0.007458
C  2.440919 1.826232 -0.267212
C  1.485561 -0.506487 0.082602
C  3.961976 -0.046036 0.438793
C  2.292426 0.825889 2.034753
C  2.661968 1.649125 -1.770193
C  0.141472 -0.081336 0.142245
C  1.846412 -1.790524 -0.366007
C  -0.868847 -0.983135 -0.269732
C  0.813142 -2.672995 -0.769025
C  -0.535366 -2.28251 -0.726155
C  -2.803104 0.568912 0.145769
C  -5.057529 1.586853 0.339423
H  1.437808 2.232706 -0.064229
H  3.188539 2.504788 0.18053
H  4.175294 -0.324149 -0.601211
H  4.656387 0.745593 0.758962
H  4.07201 -0.920385 1.096527
H  2.343411 -0.107431 2.614754
H  3.064185 1.534203 2.374776
H  1.296008 1.274242 2.14675
H  2.46825 2.620766 -2.25753
H  3.694983 1.361482 -2.026398
H  1.961866 0.917478 -2.206461
H  -0.166397 0.907668 0.487526
H  2.881124 -2.133626 -0.415942
H  1.073316 -3.675735 -1.120188
H  -1.33574 -2.959096 -1.036847
H  -4.532925 -0.405573 -0.341227
H  -5.761974 1.2901 1.135695
H  -5.629234 1.902544 -0.550486
H  -4.454928 2.436022 0.695478
