program: Gaussian 09
title: 000045978
version: EM64L-G09RevD.01
frameworkgroup: C1[X(C14H31N2O2)]
method: RPBEPBE
basis: SDD
operation: Freq
keyword: #p
keyword: freq=noraman
keyword: PBEPBE/SDD
title: #p freq=noraman PBEPBE/SDD
converged: YES YES NO NO
title: Mulliken charges:
elementType: O O N N C C C C C C C C C C C C C C H H H H H H H H H H H H H H H H H H H H H H H H H H H H H H H
charge: -0.296331 -0.279895 -0.110544 -0.615700 -0.353518 -0.410759 -0.377215 -0.387417 -0.389125 -0.555328 -0.544761 -0.554771 -0.384794 -0.382674 -0.378487 -0.395490 -0.270497 0.291409 0.267840 0.268301 0.230403 0.231438 0.210631 0.209810 0.203321 0.203832 0.202251 0.202118 0.276345 0.269861 0.261841 0.269380 0.265395 0.269230 0.269936 0.274978 0.262241 0.199384 0.199295 0.199195 0.199281 0.197298 0.197226 0.212578 0.212517 0.224616 0.224999 0.344213 0.336145
chargesum: 1.00000
title: Mulliken charges with hydrogens summed into heavy atoms:
elementType: O O N N C C C C C C C C C C C C C C
charge: -0.296331 -0.279895 -0.110544 0.064657 0.182623 0.051082 0.043225 0.019736 0.015244 0.252719 0.259244 0.252384 0.013885 0.015801 0.016037 0.029605 0.179118 0.291409
polarizability: 2.36840207e+02 2.63593127e+00 1.52038577e+02 -3.01914279e-02 -2.45253881e-03 1.31871475e+02
1716.lowfreq: -3.7666 -0.0016 0.0014 0.0016 5.4917 13.1132 18.7326 21.9346 22.7338
frequency: 14.4301 19.1778 21.9308 35.1204 57.4362 58.6521 65.2209 87.6914 93.9855 111.3343 119.2188 125.9666 129.1269 149.8734 155.4925 172.0940 182.7088 200.4445 249.9922 256.1680 266.7768 268.1345 323.3505 339.3207 374.6545 380.3172 429.2549 431.4558 458.0081 487.6999 500.0152 505.3212 517.5845 522.0433 622.3684 705.2051 726.9195 727.5706 732.7513 744.7284 763.0981 793.4069 828.3748 841.8887 856.7993 900.9970 933.5066 937.6880 974.5046 985.1122 989.5017 1010.0835 1025.4253 1030.7923 1041.5280 1043.4353 1057.0720 1063.5020 1073.2952 1079.1365 1079.3686 1081.7238 1103.3775 1123.0695 1151.8054 1156.1518 1196.5762 1206.5245 1222.4100 1222.5957 1245.0762 1247.1377 1249.0618 1268.7819 1276.1140 1280.5923 1288.4190 1296.1159 1296.3980 1302.0515 1306.5367 1310.2063 1320.5584 1333.1821 1349.3496 1357.0654 1361.3450 1367.1343 1389.3521 1419.6455 1419.7471 1445.1366 1452.5261 1457.3805 1462.6254 1463.4158 1466.5362 1467.8552 1468.8320 1469.5595 1472.0939 1477.9153 1483.3243 1485.4390 1486.3204 1489.3444 1493.0344 1501.6878 1589.4040 1688.8131 2956.0494 2957.0548 2959.5608 2963.5517 2968.5857 2973.3511 2989.5617 2991.2943 2992.8259 2997.9557 2998.6886 3006.5900 3013.7287 3018.9290 3023.4302 3027.3721 3030.8359 3031.7845 3041.7186 3047.5681 3058.5900 3072.4501 3090.8329 3139.8023 3140.3153 3143.8802 3145.8734 3154.2192 3157.9911 3558.7252 3715.7447
redmass: 4.9885 4.5641 4.4937 3.3557 2.5522 4.1403 2.0579 1.8251 2.1567 4.6714 2.0085 1.9286 4.6176 2.2832 1.8999 2.9233 4.0866 1.2268 1.8455 3.6633 1.2897 1.2091 3.1411 2.2076 3.6163 2.8138 2.2773 2.8728 2.9984 3.0299 2.8852 1.1699 1.0600 2.9504 5.8590 10.8008 1.0617 4.1966 1.0758 1.0920 1.1291 1.1880 5.1868 1.2617 3.4011 1.4169 2.0171 2.8047 1.2487 5.7632 4.7926 6.8161 1.1310 3.8235 1.1960 3.9121 2.0843 2.7583 2.5171 1.2311 2.2505 2.1722 2.3698 2.1568 1.4581 1.3788 1.6085 1.3080 1.5723 1.5197 1.7429 1.4352 1.4248 1.2456 1.3359 1.1309 1.0633 1.8375 1.1012 1.1258 1.1010 1.5810 1.2210 1.3998 1.4711 1.5584 1.6170 1.3288 1.6876 1.1441 1.1458 1.1034 1.0468 1.1151 1.0749 1.0712 1.0735 1.0417 1.0711 1.0503 1.0900 1.0932 1.0863 1.0547 1.0741 1.0943 1.0946 1.0593 1.2134 7.4400 1.0588 1.0587 1.0592 1.0593 1.0590 1.0585 1.0597 1.0970 1.0584 1.0989 1.0567 1.1012 1.0578 1.1032 1.0322 1.0336 1.0337 1.1031 1.1046 1.1052 1.1051 1.1076 1.1079 1.1055 1.1057 1.1051 1.1052 1.1050 1.1046 1.0446 1.1058
irintensity: 0.2223 2.2469 4.6614 0.0358 0.1615 0.5128 0.4989 0.9106 0.6997 5.1822 1.5591 0.2201 2.2232 2.0102 0.0901 6.2138 3.9743 0.1798 0.3716 3.8316 0.1443 0.0022 2.8887 0.2069 4.5594 1.7727 0.1627 0.8922 3.3386 0.5919 2.8416 296.0713 35.9136 1.1518 1.2042 33.4380 15.8110 0.0738 0.2938 8.3019 0.4895 1.6259 35.3269 1.1615 56.9506 2.5232 10.8417 16.4746 0.4175 11.6229 7.6187 141.3143 0.2582 0.4862 0.0184 16.7951 37.2634 2.4684 13.8274 0.0018 0.3042 0.7859 27.7385 0.6130 0.0225 1.0363 0.0596 23.9692 3.6648 0.0707 1.2764 0.0115 2.8928 0.8147 7.4149 1.3912 0.5199 329.2916 1.3721 0.3897 0.1151 110.6764 0.0830 42.8047 2.1972 4.0532 3.5410 2.7497 23.1650 18.8586 17.6275 2.1072 0.0266 8.8305 0.0344 1.6235 0.3262 0.4141 0.4021 1.5075 1.6117 1.6591 6.5911 42.8326 39.0472 19.3278 26.8696 86.3165 103.4331 369.8596 0.2901 0.2349 1.3271 0.8337 36.1306 111.4828 13.1237 0.1615 25.6391 0.2453 56.2563 0.4832 14.4410 1.7231 5.0293 2.4856 2.6785 3.5441 13.7250 78.0064 63.5320 97.4129 24.7235 0.6198 0.1240 4.4110 11.2148 0.9166 6.2319 66.5743 51.9487
temp: 298.150 k
press: 1.00000 atm
elementType: 8 8 7 7 6 6 6 6 6 6 6 6 6 6 6 6 6 6 1 1 1 1 1 1 1 1 1 1 1 1 1 1 1 1 1 1 1 1 1 1 1 1 1 1 1 1 1 1 1
symmnumber: 1
zpe: 1163465.7 jmol-1
zpe.correction: 0.443141 hartree
zpe.thermalcorrener: 0.466637 hartree
zpe.thermalcorrenthalpy: 0.467581 hartree
zpe.thermalcorrgfe: 0.386281 hartree
zpe.sumelectzpe: -810.305776 hartree
zpe.sumelectthermal: -810.282280 hartree
zpe.sumelectthermalent: -810.281336 hartree
zpe.sumelectthermalfe: -810.362636 hartree
dipole: 31.5698 -2.2863 0.0031
dipole: 31.6525
quadrupole: 132.6865 -108.8716 -105.0982
quadrupole: 27.3356 0.1567 -0.0015
quadrupole: 159.7809 -81.7772 -78.0038 27.3356 0.1567 -0.0015
hfenergy: -810.7489171 hartree
pointgroup: C01 [X(C14H31N2O2)]
dipole: -12.4292026 -0.7659552 0.0816189 debye
polarizability: 236.7733473|-3.5439387|152.069038|-0.3076906|-0.8339196|131.9078739 unknown
InChI: InChI=1S/C14H31N2O2/c1-16(2,3)12-10-8-6-4-5-7-9-11-13-18-14(15)17/h4-13,15H2,1-3H3
charge 1 multiplicity 1
49 atoms
O  6.798901 -0.56958 -0.013173
O  8.19294 1.331784 -0.10291
N  -7.260608 0.137948 0.012397
N  9.058011 -0.851841 -0.0102
C  -5.88121 -0.588326 0.063637
C  -4.639408 0.311704 -0.000632
C  -3.354759 -0.561539 0.036126
C  -2.066769 0.292982 -0.00499
C  -0.779056 -0.561723 0.017507
C  -7.403848 1.106855 1.183435
C  -8.357554 -0.923236 0.107963
C  -7.42006 0.89789 -1.302288
C  0.508107 0.293122 -0.015746
C  1.800903 -0.553214 0.003704
C  3.083255 0.308196 -0.029478
C  4.375875 -0.54032 -0.007016
C  5.625868 0.34047 -0.045846
C  8.049534 0.08547 -0.047293
H  -5.888479 -1.170313 1.003061
H  -5.889909 -1.298169 -0.783236
H  -4.624901 0.91186 -0.929977
H  -4.608692 1.012248 0.855045
H  -3.35575 -1.262499 -0.82329
H  -3.351049 -1.182838 0.954893
H  -2.069794 0.923571 -0.917994
H  -2.057429 0.989118 0.858948
H  -0.780349 -1.254835 -0.849095
H  -0.772719 -1.197244 0.927218
H  -6.65458 1.904931 1.091751
H  -7.252017 0.557453 2.12509
H  -8.414565 1.542891 1.163368
H  -8.259748 -1.620363 -0.73816
H  -9.342316 -0.432291 0.074593
H  -8.246415 -1.471352 1.055884
H  -7.270459 0.200498 -2.140637
H  -6.677394 1.705954 -1.352415
H  -8.434222 1.324046 -1.346882
H  0.512256 0.985583 0.851615
H  0.503098 0.930872 -0.924127
H  1.811183 -1.19056 0.912094
H  1.802136 -1.245257 -0.863739
H  3.080539 1.001751 0.836884
H  3.073205 0.944477 -0.938737
H  4.401385 -1.166575 0.905657
H  4.390931 -1.230222 -0.872787
H  5.678254 1.023975 0.822399
H  5.67289 0.953109 -0.965746
H  10.021788 -0.530855 -0.028744
H  8.841898 -1.844504 0.034568
