program: Gaussian 09
title: H_S_uu-MeCN
version: ES64L-G09RevE.01
frameworkgroup: C1[X(C20H17N2O3Pd)]
method: RwB97XD
basis: Gen
operation: Freq
keyword: #P
keyword: Geom=AllCheck
keyword: Guess=TCheck
keyword: SCRF=Check
keyword: GenChk
keyword: RwB97XD/ChkBas
keyword: Freq
converged: YES YES YES YES
title: Mulliken charges:
elementType: C C C C C C C H H H H C C N C H C C H H H N O Pd O O C H H C H H C C C H C C H H H C H
charge: 0.290405 0.255718 -0.150361 -0.158571 -0.156503 -0.177821 0.576523 0.190524 0.176636 0.179191 0.203239 0.251352 -0.138081 -0.578545 -0.118644 0.222090 0.065950 -0.137637 0.205845 0.210741 0.204264 -0.794976 -0.457287 0.409775 -0.183864 -0.180240 -0.370335 0.176464 0.177435 0.031306 0.200415 0.461237 0.036004 -0.133524 -0.166360 0.185376 -0.152766 -0.144566 0.163365 0.161305 0.160887 -0.158619 0.162652
chargesum: 1.00000
title: Mulliken charges with hydrogens summed into heavy atoms:
elementType: C C C C C C C C C N C C C N O Pd O O C C C C C C C C
charge: 0.290405 0.255718 0.040163 0.018065 0.022688 0.025419 0.576523 0.251352 0.084009 -0.578545 0.087201 0.276691 0.066627 -0.794976 -0.457287 0.409775 0.277373 -0.180240 -0.016435 0.231721 0.036004 0.051851 -0.002995 0.008539 0.016321 0.004033
polarizability: 4.15692740e+02 -1.31904132e+01 4.42864385e+02 -4.91929495e+01 3.57532199e+01 2.77389996e+02
1716.lowfreq: -7.9956 -6.2092 -0.0007 -0.0006 -0.0004 9.4124 20.7851 30.1405 41.3587
frequency: 20.5677 29.5122 41.0428 55.7122 78.3939 84.4791 92.4939 111.4967 122.4214 155.1726 181.9328 194.9376 195.0738 217.9648 249.0475 294.6656 302.4519 321.1533 328.2657 349.3813 368.6105 373.2392 420.5775 428.8551 439.2957 457.5111 508.1275 532.0132 553.8804 577.5268 583.1898 588.3147 601.1330 631.4191 636.1170 652.4210 664.4670 720.3190 723.7571 727.2147 733.8048 768.6089 770.3884 772.5858 773.3837 806.5851 816.8108 850.8856 860.5625 884.6504 889.3049 899.3920 918.8191 930.3764 936.2212 967.2507 980.9613 1007.9236 1010.8930 1016.0034 1020.6763 1024.3905 1034.6198 1042.4028 1049.6954 1053.1883 1056.7480 1074.2837 1087.1401 1119.9395 1133.2954 1140.8985 1150.2400 1175.1221 1178.3726 1182.9629 1187.8745 1201.4989 1228.6754 1232.7231 1235.3967 1304.6645 1306.9336 1325.0429 1331.4384 1345.8717 1353.6467 1357.9394 1370.0350 1384.9592 1385.3406 1458.7538 1476.8049 1487.2368 1503.0740 1508.1628 1533.9081 1544.3027 1558.2471 1626.5223 1665.6161 1669.7323 1683.8035 1692.5137 1700.0426 1704.8172 3080.3979 3091.0080 3166.4123 3210.1674 3214.3494 3224.4143 3230.6450 3240.1500 3242.7662 3247.3444 3252.1954 3256.2052 3260.6566 3263.1578 3268.8176 3270.1940 3709.3155
redmass: 5.8053 6.5818 4.0371 5.1321 5.8650 6.0124 4.6429 5.7556 4.7948 7.9335 6.2615 5.6746 7.5626 5.0201 4.7062 7.1930 5.8836 6.9764 5.7148 4.7386 5.5231 6.5587 2.9625 3.3215 3.3027 4.4579 3.6300 3.2714 4.1395 8.2599 5.5833 3.7313 4.8481 1.2897 5.0953 6.9982 6.9677 4.6635 2.0000 6.4082 2.8394 2.9001 1.7446 1.9147 1.7761 1.7962 2.4038 5.7383 3.6583 1.2483 1.3999 5.1517 7.0532 4.0997 1.3370 1.4477 1.3610 1.4353 8.5411 1.3684 1.3130 5.7338 1.3266 2.1284 2.1239 7.3977 1.3495 2.0851 2.2301 1.4901 1.5457 1.4245 1.3847 1.3294 1.4331 1.1132 1.1188 3.3132 1.4728 1.2382 3.5965 1.8120 2.5712 1.5812 1.9375 2.5193 3.6928 1.1284 2.3076 1.3072 6.5373 3.8839 1.1448 2.3737 2.2923 2.5030 3.1374 3.5634 2.2511 9.1102 6.4241 5.8103 7.4346 5.7519 7.4700 7.9043 1.0761 1.0692 1.1047 1.0889 1.0875 1.0909 1.0954 1.0892 1.0994 1.0901 1.0920 1.0922 1.0970 1.0981 1.1003 1.0962 1.0679
irintensity: 0.6605 0.1992 0.2046 2.3249 0.9793 2.0930 0.1927 1.3737 1.1482 2.5901 2.2329 2.4890 3.5069 14.2956 5.5247 0.2895 6.9537 5.5501 1.2495 14.2512 4.8899 7.4347 0.1937 4.2337 14.7402 1.7493 5.3077 8.2503 20.1480 0.9059 19.4726 0.3704 10.5948 214.8764 14.1694 0.2815 19.4568 26.9998 49.7919 3.4538 15.3646 42.9256 23.8721 119.6529 71.6861 2.8401 24.2222 41.3372 4.1472 0.2506 0.0330 25.2607 13.2687 37.4175 3.2592 6.2747 7.8896 0.9502 5.0025 0.0426 0.1084 1.5660 0.9688 17.0565 23.5959 36.8083 0.0520 3.8947 9.3755 5.5524 42.3034 1.7267 11.8903 20.3369 6.9186 0.7601 3.4720 31.6667 15.0489 12.4546 28.2766 65.2368 14.9110 8.9835 10.1242 30.9566 72.3031 60.1093 30.1656 3.4209 5.8877 223.7097 5.9756 58.2930 20.9984 44.6292 32.2107 34.7201 10.6676 188.7650 11.0448 0.9130 14.9658 0.3319 6.3679 6.0415 8.3677 29.6221 18.4111 6.5764 2.6549 3.6989 33.1316 4.4082 19.8253 3.4370 5.1807 2.8986 0.2673 1.6302 4.5371 2.9188 230.6526
temp: 298.150 k
press: 1.00000 atm
elementType: 6 6 6 6 6 6 6 1 1 1 1 6 6 7 6 1 6 6 1 1 1 7 8 46 8 8 6 1 1 6 1 1 6 6 6 1 6 6 1 1 1 6 1
symmnumber: 1
zpe: 887194.4 jmol-1
zpe.correction: 0.337914 hartree
zpe.thermalcorrener: 0.359045 hartree
zpe.thermalcorrenthalpy: 0.359989 hartree
zpe.thermalcorrgfe: 0.286014 hartree
zpe.sumelectzpe: -1234.612984 hartree
zpe.sumelectthermal: -1234.591854 hartree
zpe.sumelectthermalent: -1234.590910 hartree
zpe.sumelectthermalfe: -1234.664885 hartree
dipole: -4.9296 4.1430 2.7351
dipole: 6.9961
quadrupole: -103.4848 -99.2723 -157.1274
quadrupole: -5.7474 -5.6292 9.5439
quadrupole: 16.4767 20.6892 -37.1659 -5.7474 -5.6292 9.5439
hfenergy: -1234.9508986 hartree
pointgroup: C01 [X(C20H17N2O3Pd1)]
dipole: -1.9014728 1.6875167 1.0549416 debye
polarizability: 415.667762|-12.8987969|443.8991828|-47.1456965|36.2533679|276.3801752 unknown
InChI: InChI=1S/C12H8N2O.C8H9O2.Pd/c1-2-7-11-9(5-1)14-12(15-11)10-6-3-4-8-13-10;1-7(10-9)8-5-3-2-4-6-8;/h1-8H;2-7,9H,1H2;/q-2;;+2
charge 1 multiplicity 1
43 atoms
C  -3.44899955 -1.48210037 0.46952039
C  -2.17925293 -1.69735146 -0.06255135
C  -1.77542737 -2.98363667 -0.4171087
C  -2.69084548 -4.00478761 -0.19754242
C  -3.96217776 -3.76216 0.35125719
C  -4.37689339 -2.48130943 0.69867279
C  -2.43894802 0.40867689 0.31131869
H  -0.80272703 -3.17792053 -0.85034122
H  -2.41834153 -5.02185249 -0.45864445
H  -4.64063346 -4.59466621 0.50339668
H  -5.35518426 -2.27611768 1.11686246
C  -2.19898341 1.84642803 0.36225507
C  -3.11982787 2.76725067 0.83262223
N  -0.98306812 2.18904102 -0.11473216
C  -2.76426532 4.11464408 0.80407429
H  -4.08334296 2.44298513 1.20801083
C  -0.65157287 3.48015509 -0.13727257
C  -1.51772747 4.47530417 0.31280017
H  -3.45770163 4.86773114 1.1610548
H  0.32977664 3.72456593 -0.52774121
H  -1.20731391 5.5125025 0.27120293
N  -1.55940243 -0.44711756 -0.13845434
O  -3.59193552 -0.13280559 0.69946448
Pd 0.20360911 0.42859663 -0.69033785
O  2.01035536 1.30919506 -1.34360915
O  2.8468341 0.31525165 -1.97311485
C  1.19643661 -1.25343988 -1.14663927
H  1.0302096 -2.04150125 -0.40817321
H  0.82390939 -1.58382439 -2.12288091
C  2.68020408 -0.9126756 -1.23280378
H  3.18596347 -1.61395961 -1.90939441
H  2.5687798 1.65224753 -0.61887397
C  3.45206563 -0.84680772 0.07251656
C  2.84010756 -0.61478588 1.30765373
C  3.60527284 -0.51821999 2.4694533
H  1.75964391 -0.51501238 1.37202775
C  5.60851356 -0.891573 1.18228821
C  4.98922684 -0.65597349 2.40932661
H  3.11563994 -0.34011175 3.42203011
H  6.68647213 -1.00877815 1.12822253
H  5.58296312 -0.58619823 3.31563326
C  4.84389101 -0.98578235 0.02431572
H  5.32879058 -1.17421825 -0.93024593
