program: Gaussian 09
title: I_to_Hp_Ruu-TS-MeCN-TEST-disp-b
version: ES64L-G09RevE.01
frameworkgroup: C1[X(C20H17N2O3Pd)]
method: RwB97XD
basis: Gen
operation: Freq
keyword: #P
keyword: Geom=AllCheck
keyword: Guess=TCheck
keyword: SCRF=Check
keyword: GenChk
keyword: RwB97XD/ChkBas
keyword: Freq
converged: YES YES NO YES
title: Mulliken charges:
elementType: C C C C C C C H H H H C C N C H C C H H H N O Pd O O C H H C H C C C C H C H C H H H H
charge: 0.292069 0.255323 -0.147929 -0.159794 -0.156153 -0.179146 0.577608 0.196057 0.176718 0.178937 0.203400 0.248927 -0.138089 -0.546020 -0.120013 0.221059 0.068451 -0.138585 0.205290 0.211877 0.203417 -0.930334 -0.456180 0.538546 -0.538627 0.172995 -0.393139 0.191078 0.183727 0.017471 0.430763 0.067909 -0.150712 -0.164478 -0.161743 0.182484 -0.152948 0.164832 -0.141758 0.163672 0.162883 0.162439 0.197714
chargesum: 1.00000
title: Mulliken charges with hydrogens summed into heavy atoms:
elementType: C C C C C C C C C N C C C N O Pd O O C C C C C C C C
charge: 0.292069 0.255323 0.048128 0.016924 0.022785 0.024254 0.577608 0.248927 0.082970 -0.546020 0.085277 0.280328 0.064832 -0.930334 -0.456180 0.538546 -0.107865 0.172995 -0.018334 0.215185 0.067909 0.031771 0.000353 0.001930 0.009936 0.020681
polarizability: 4.40700756e+02 1.30958330e+01 4.41085548e+02 3.50078967e+01 1.25490346e+01 2.68426211e+02
1716.lowfreq: -12.9524 -7.6326 -5.0528 -0.0006 -0.0005 0.0003 15.2996 27.7438 35.4183
frequency: 10.7165 26.9089 34.7748 40.3174 58.4006 70.4627 89.7105 100.9404 109.2479 136.1957 168.1913 186.9300 192.3266 207.2082 245.4506 253.5791 284.0109 291.9406 318.2119 323.8159 331.2730 368.3889 369.5932 420.1378 425.2435 436.5466 438.1217 504.9354 507.6689 560.0281 576.2462 588.3095 591.2156 615.9106 635.7815 646.1064 652.0480 662.7271 719.8191 720.9142 727.4402 739.7282 764.8235 770.8121 774.1390 778.1088 818.0789 833.5322 840.5405 850.6395 876.5412 881.0501 919.6201 933.8371 963.3438 977.4577 995.4553 1010.5910 1011.6311 1014.5694 1022.3868 1024.1984 1032.6777 1036.2821 1046.2352 1049.4729 1050.6009 1069.7152 1087.8731 1105.2113 1108.9436 1130.0072 1143.8791 1149.6433 1174.1335 1184.0411 1187.8667 1200.7268 1211.3459 1233.7432 1236.4185 1300.5636 1310.3174 1329.4420 1332.2882 1336.4435 1355.4019 1367.8354 1385.8859 1395.4196 1428.6642 1459.9830 1483.4312 1487.7629 1508.2750 1510.9965 1533.9792 1545.0183 1550.2571 1629.4347 1665.2308 1670.3917 1685.0972 1689.6262 1701.1402 1704.4987 3113.9926 3167.2387 3192.4773 3210.4335 3217.8319 3225.4589 3236.1257 3238.9034 3245.1578 3247.5530 3251.4438 3257.5790 3267.2101 3270.6251 3273.2493 3278.7764 3770.4838
redmass: 6.0456 4.9172 4.5315 5.1504 6.1132 5.5160 4.4702 5.5983 5.9688 6.6267 8.8471 6.4405 5.7679 5.3967 3.2135 1.1535 7.2585 7.6220 6.3445 5.8395 5.1974 5.8554 7.2379 2.8837 3.3199 3.2145 6.1363 5.0170 3.6336 3.5227 8.3823 3.8409 7.5175 3.5611 6.1961 5.2445 7.0755 7.0043 1.8488 4.3767 6.5269 1.4766 3.6470 1.8110 1.4542 2.1995 2.3869 2.7439 3.5717 5.8276 1.2530 1.4182 7.2071 1.3348 1.4235 1.3586 7.9095 1.3723 1.4108 8.7181 1.3132 5.9666 1.9176 1.5212 2.0696 7.4943 1.3573 1.9366 2.1811 1.6016 1.3905 1.5862 1.5127 1.5330 1.1342 1.1196 1.1087 3.3473 1.1159 3.5387 1.8489 1.2123 2.5697 1.9463 1.7857 2.6759 3.4691 2.2299 6.8355 1.5739 1.1158 3.7735 1.1865 2.3042 2.5782 2.1775 3.1533 3.4333 2.4191 8.9741 6.3795 5.8516 7.5022 6.0246 7.6623 7.8511 1.0583 1.0895 1.1078 1.0902 1.0876 1.0917 1.0960 1.0892 1.0988 1.0922 1.0937 1.0911 1.0953 1.0969 1.1005 1.0955 1.0685
irintensity: 0.4946 0.2160 0.0146 0.9622 5.2164 1.6151 0.1779 0.9296 1.0472 1.3625 4.6809 2.6609 1.0677 10.7003 1.9006 171.8366 5.1099 4.5127 1.9770 4.9298 4.6850 10.8501 4.4814 0.9868 3.9985 9.4540 23.2819 1.2702 4.9586 26.9271 1.2292 0.3697 14.1893 38.9234 1.4453 32.2798 0.2768 20.3671 52.0898 28.0213 1.9191 44.4485 13.6743 15.9519 148.6044 111.5355 17.6908 37.9225 16.2059 48.7029 0.2731 0.0652 11.0998 0.6671 1.6644 4.1477 2.9279 0.1758 1.0525 6.5227 0.0456 0.8632 7.7573 3.5075 17.1346 37.7667 0.0946 3.3960 10.0577 13.0836 5.8646 36.0106 5.3238 6.7107 4.2304 3.0536 0.1663 36.9899 1.4224 29.8509 24.6572 26.4940 7.8631 29.8265 3.4942 32.2241 57.2245 4.2474 4.2982 29.1295 93.0569 229.1344 5.9663 51.0307 32.7996 35.7403 34.3269 34.8190 3.8548 196.1366 13.4506 0.4775 14.4362 4.6752 5.9740 4.8726 20.0768 6.0566 12.5232 6.5284 0.3388 10.4458 28.4603 3.0662 16.0148 5.8837 8.1002 2.0769 0.7827 0.5548 1.9650 1.8635 201.6727
temp: 298.150 k
press: 1.00000 atm
elementType: 6 6 6 6 6 6 6 1 1 1 1 6 6 7 6 1 6 6 1 1 1 7 8 46 8 8 6 1 1 6 1 6 6 6 6 1 6 1 6 1 1 1 1
symmnumber: 1
zpe: 883559.5 jmol-1
zpe.correction: 0.336530 hartree
zpe.thermalcorrener: 0.358452 hartree
zpe.thermalcorrenthalpy: 0.359397 hartree
zpe.thermalcorrgfe: 0.282343 hartree
zpe.sumelectzpe: -1234.602239 hartree
zpe.sumelectthermal: -1234.580316 hartree
zpe.sumelectthermalent: -1234.579372 hartree
zpe.sumelectthermalfe: -1234.656426 hartree
dipole: 3.5142 4.1115 0.5372
dipole: 5.4353
quadrupole: -89.2213 -100.4553 -153.2927
quadrupole: 2.2877 12.4565 4.0496
quadrupole: 25.1018 13.8678 -38.9696 2.2877 12.4565 4.0496
hfenergy: -1234.9387686 hartree
pointgroup: C01 [X(C20H17N2O3Pd1)]
dipole: 1.2628916 1.7127213 0.2110471 debye
polarizability: 437.7688755|13.1368523|443.2396832|36.5540798|13.1145192|269.2039567 unknown
InChI: InChI=1S/C12H8N2O.C8H9O2.Pd/c1-2-7-11-9(5-1)14-12(15-11)10-6-3-4-8-13-10;1-7(10-9)8-5-3-2-4-6-8;/h1-8H;2-7,9H,1H2;/q-2;;+2
charge 1 multiplicity 1
43 atoms
C  3.66110842 -1.38987952 0.35630299
C  2.34138041 -1.63012962 -0.01938174
C  1.90673854 -2.92421657 -0.29584108
C  2.85363561 -3.9331674 -0.1746361
C  4.18111497 -3.66663961 0.20512335
C  4.62172608 -2.37662425 0.48184491
C  2.6033086 0.48199734 0.31592357
H  0.88425603 -3.12975845 -0.58839472
H  2.56161565 -4.95796418 -0.37777166
H  4.88325384 -4.48979575 0.28329551
H  5.64207297 -2.15706758 0.77295628
C  2.31859331 1.90867163 0.42238726
C  3.24678129 2.86094783 0.80704883
N  1.03880372 2.20293675 0.10767395
C  2.82557435 4.18840572 0.87197847
H  4.26409708 2.57620326 1.04887643
C  0.64450459 3.473879 0.17396125
C  1.51085959 4.49834548 0.55372683
H  3.52007068 4.96533407 1.17062864
H  -0.39056402 3.67263697 -0.08132704
H  1.14769653 5.51827849 0.59600298
N  1.69756874 -0.39283699 -0.03114565
O  3.8051162 -0.03584047 0.56532397
Pd -0.12119656 0.40843045 -0.45117943
O  -2.21727574 1.69241794 -2.09084476
O  -2.11637475 0.95287005 -0.87152198
C  -1.17282727 -1.21229195 -0.96196978
H  -0.80698511 -1.61004507 -1.91179802
H  -1.1561404 -1.97974528 -0.1862886
C  -2.50819409 -0.50095162 -1.10103815
H  -3.04617967 2.18029965 -1.94228698
C  -3.57894586 -0.80480629 -0.09661866
C  -3.27360053 -0.94390855 1.26295905
C  -4.90765584 -0.91290061 -0.51520844
C  -4.2851375 -1.18229431 2.18701936
H  -2.24310946 -0.86432379 1.59990064
C  -5.9188276 -1.16235149 0.4098673
H  -5.14708376 -0.80532057 -1.56976295
C  -5.60889609 -1.29470249 1.76120672
H  -4.04221764 -1.28744862 3.23980255
H  -6.94739192 -1.25233668 0.07460226
H  -6.3961801 -1.48728736 2.48364379
H  -2.90762531 -0.51766155 -2.11563814
