program: Gaussian 09
title: 000046006
version: EM64L-G09RevD.01
frameworkgroup: C1[X(C12H19N2O2)]
method: RPBEPBE
basis: SDD
operation: Freq
keyword: #p
keyword: freq=noraman
keyword: PBEPBE/SDD
title: #p freq=noraman PBEPBE/SDD
converged: YES YES NO NO
title: Mulliken charges:
elementType: O O N N C C C C C C C C C C C C H H H H H H H H H H H H H H H H H H H
charge: -0.330592 -0.283933 -0.103899 -0.354748 -0.546070 -0.557758 -0.541017 -0.577384 0.493849 -0.480225 -0.414386 0.383532 -0.196318 -0.375808 0.287971 -0.598805 0.271299 0.278473 0.258567 0.261205 0.294465 0.266939 0.266796 0.263090 0.254282 0.333273 0.258620 0.287703 0.247376 0.255381 0.278543 0.352278 0.251530 0.248970 0.266798
chargesum: 1.00000
title: Mulliken charges with hydrogens summed into heavy atoms:
elementType: O O N N C C C C C C C C C C C C
charge: -0.330592 -0.283933 -0.103899 -0.002470 0.003702 0.256479 0.255807 0.268793 0.493849 -0.192521 -0.167010 0.383532 0.059064 -0.097265 0.287971 0.168493
polarizability: 1.97186477e+02 -5.02071129e+00 1.57052597e+02 1.21998534e+00 1.06474634e+01 9.63967648e+01
1716.lowfreq: -0.0002 0.0006 0.0008 3.3573 5.3872 6.9930 33.4725 47.6975 59.3916
frequency: 33.3930 47.6543 59.3896 68.2029 95.1394 101.9758 130.5561 171.3327 194.7170 225.8071 249.3080 259.3755 277.5607 280.7714 296.1058 322.6341 336.0966 357.4954 396.2062 407.9887 431.2177 440.0209 484.2751 540.5443 597.9550 616.2154 634.5180 657.6596 685.3377 699.7417 721.5327 754.8787 805.9145 820.3504 852.6474 895.8501 904.7875 922.4770 939.2827 955.8260 983.3747 989.1888 992.7746 1042.9923 1055.9173 1081.9175 1098.1987 1099.8368 1125.9308 1148.2412 1159.7126 1178.1643 1181.8392 1199.7488 1215.7478 1240.4353 1261.6913 1286.6896 1314.3035 1348.0185 1394.0851 1420.1420 1421.2389 1435.8758 1437.9870 1450.5360 1454.0633 1457.0598 1462.6556 1466.4821 1472.9057 1481.0277 1481.9778 1484.3525 1487.9585 1504.0455 1517.3960 1599.8246 1610.1620 1711.0043 2999.1161 3018.8782 3022.1658 3025.0474 3028.7331 3085.0518 3098.7572 3128.1368 3131.9153 3135.0295 3138.2595 3140.9741 3143.3646 3144.0451 3156.3613 3163.1661 3177.9659 3182.7806 3560.5230
redmass: 3.3666 3.6668 4.1240 4.4818 3.3435 1.1251 3.6796 3.1563 1.2284 2.4453 3.7849 3.4695 1.2026 1.8111 2.0151 2.3885 3.2909 3.4150 2.7108 2.9949 2.1588 2.7552 2.7556 4.7597 6.8314 4.6054 1.1967 5.7403 9.0434 3.0254 3.0032 4.3129 2.1833 2.1302 4.4830 2.2619 1.5381 1.4486 3.0382 2.2707 2.0131 5.3478 1.3913 1.2088 4.8751 1.4654 1.3269 1.3514 1.2889 1.7695 1.9654 1.2903 1.1192 2.1046 1.7449 1.8129 3.2445 1.6074 1.2750 1.3715 8.1825 1.1452 1.1433 1.2078 2.3750 1.0976 1.0769 1.1137 1.3026 1.0606 1.0874 1.1307 1.6527 1.0540 1.1610 1.0550 1.4413 6.5776 6.0002 9.7256 1.0349 1.0323 1.0353 1.0503 1.0380 1.1032 1.1077 1.1000 1.0909 1.1047 1.1051 1.1049 1.1047 1.1062 1.1045 1.0915 1.0929 1.0983 1.0775
irintensity: 2.5349 4.4039 3.2140 9.1072 0.3673 0.5078 3.3194 1.1341 0.8525 5.4183 0.4135 3.0617 1.0762 0.4346 2.1698 3.7872 4.7550 18.4292 1.3286 2.7253 0.2045 2.6015 2.0054 1.3131 1.5644 14.4440 105.5342 7.7083 36.2354 12.1423 30.7936 7.4627 88.0519 24.7923 80.8252 2.3562 18.0995 2.3868 45.5455 11.3735 1.8250 2.2910 1.2610 2.6098 220.5306 4.4058 0.1129 11.7538 0.0389 210.2216 159.2864 1.9993 2.8502 90.0843 0.5276 2.2587 79.1044 3.1741 2.4658 20.5157 10.2031 19.4687 19.5597 26.4151 101.1807 5.8534 0.5189 7.4365 90.8432 3.5598 18.1550 19.6969 53.6393 51.5492 10.2513 86.8256 139.3426 20.1164 19.1700 398.3776 43.8131 5.3561 1.4501 14.7903 12.7537 19.4450 2.5011 3.8621 4.7803 1.3681 0.4990 1.5601 9.9377 10.3521 1.3391 5.6218 1.2826 0.7730 74.2650
temp: 298.150 k
press: 1.00000 atm
elementType: 8 8 7 7 6 6 6 6 6 6 6 6 6 6 6 6 1 1 1 1 1 1 1 1 1 1 1 1 1 1 1 1 1 1 1
symmnumber: 1
zpe: 783006.8 jmol-1
zpe.correction: 0.298232 hartree
zpe.thermalcorrener: 0.315265 hartree
zpe.thermalcorrenthalpy: 0.316209 hartree
zpe.thermalcorrgfe: 0.253236 hartree
zpe.sumelectzpe: -727.169745 hartree
zpe.sumelectthermal: -727.152712 hartree
zpe.sumelectthermalent: -727.151768 hartree
zpe.sumelectthermalfe: -727.214740 hartree
dipole: -6.8178 -3.0840 0.1233
dipole: 7.4839
quadrupole: -21.7039 -73.8826 -90.4437
quadrupole: 8.0914 -1.7536 4.5000
quadrupole: 40.3061 -11.8725 -28.4336 8.0914 -1.7536 4.5000
hfenergy: -727.4679765 hartree
pointgroup: C01 [X(C12H19N2O2)]
dipole: -2.722354 1.1177103 -0.0946612 debye
polarizability: 196.8092127|6.2654961|157.5949638|-0.2083768|10.2790697|96.231662 unknown
InChI: InChI=1S/C12H19N2O2/c1-13-12(15)16-11-7-5-6-10(8-11)9-14(2,3)4/h5-8,13H,9H2,1-4H3
charge 1 multiplicity 1
35 atoms
O  2.376213 -0.756977 0.292184
O  1.779485 1.460896 -0.380004
N  -2.863853 1.100544 -0.13105
N  3.990272 0.828983 0.137448
C  -2.503522 -0.002186 0.947026
C  -3.165153 0.447698 -1.475117
C  -4.103834 1.840439 0.363089
C  -1.718573 2.101285 -0.302149
C  -1.358444 -0.896015 0.544811
C  -0.030464 -0.434497 0.71082
C  -1.592053 -2.182111 -0.008264
C  1.041424 -1.208619 0.220783
C  -0.500492 -2.982149 -0.415914
C  0.82049 -2.490625 -0.327557
C  2.654389 0.633213 -0.021329
C  4.639239 2.124299 -0.112213
H  -3.438708 -0.569637 1.090917
H  -2.286284 0.572359 1.864228
H  -3.98891 -0.272136 -1.351507
H  -3.456835 1.231372 -2.191354
H  -2.266514 -0.074567 -1.83126
H  -3.891775 2.28259 1.34861
H  -4.359925 2.636598 -0.352666
H  -4.941807 1.131432 0.445578
H  -1.527367 2.592698 0.664457
H  -0.805891 1.589209 -0.64044
H  -2.02632 2.852792 -1.046076
H  0.173856 0.522951 1.195322
H  -2.614593 -2.565271 -0.107136
H  -0.677226 -3.98346 -0.819994
H  1.673549 -3.081308 -0.673532
H  4.550489 0.025023 0.427405
H  5.384002 2.039283 -0.922675
H  5.139838 2.492368 0.800339
H  3.868695 2.849826 -0.413977
