program: Orca
programVersion: 5.0.3
elementType: N C S
charge: 0
multiplicity: 2
keywords: SP DSD-BLYP D3BJ def2-QZVPP def2-QZVPP/C def2/J TightSCF keepdens
formula: CNS
InChI: InChI=1S/CNS/c2-1-3
3 atoms
N  -1.25034 0.0747 0.0000
C  -0.15118 -0.32499 -0.0000
S  1.40152 -0.88731 0.0000
totalener: -490.47725225 hartree
nucrepener: 70.77543761 hartree
electener: -561.25268986 hartree
oneelecener: -814.57020267 hartree
twoeener: 253.31751281 hartree
kineticenergy: 489.91454050 hartree
exchangeener: -11.411478199153 hartree
correlationener: -0.591497286461 hartree
xcener: -12.002975485614 hartree
s2: 0.825335
energy: -2472.3670 -412.0164 -297.1042 -235.4375 -175.5925 -175.2616 -175.1184 -31.3334 -26.7306 -16.8607 -14.3267 -14.3025 -13.7213 -11.4892 -10.2877 2.1310 2.1470 2.4911 3.4576 4.1992 4.5984 4.8186 6.2488 6.4742 6.5687 7.7814 7.8213 8.9390 10.4340 10.6286 12.3736 12.9156 13.4630 14.5896 15.6013 15.6082 19.0315 20.9678 22.1947 22.2983 25.2826 25.6853 26.1092 26.2940 26.3079 26.9452 27.6240 27.6694 27.8353 28.5546 29.9813 29.9960 30.7239 31.2837 33.8807 34.7582 35.1812 35.5017 35.6569 36.0818 40.5099 41.5777 42.0081 43.7483 47.0124 48.7461 48.7471 50.3115 50.6687 52.6527 52.6531 56.6589 58.1468 58.2072 58.2205 58.4577 61.4898 62.8962 68.4475 68.6825 72.8071 72.8074 75.2433 75.2476 78.9077 79.3743 79.6335 80.7508 80.9731 82.4864 82.4909 83.7712 83.7713 84.3878 84.9356 84.9425 84.9459 85.0393 89.3430 89.3466 91.0163 92.5341 92.5680 95.2989 95.8902 97.0154 98.1247 98.7953 99.0050 102.7834 103.4472 104.2315 104.2419 106.2880 111.5414 112.8067 113.3148 119.4906 119.9517 129.2090 134.4536 134.4539 138.6697 138.6727 144.5177 144.8580 146.5534 151.8752 156.9397 157.0123 157.0939 157.0947 165.6435 165.6442 166.3603 166.3634 172.0860 172.0885 173.0496 173.2621 175.7852 191.9555 191.9579 198.7514 203.5924 203.5947 208.1133 211.6934 211.8984 215.7961 231.7781 232.8367 232.8494 236.7374 236.7374 237.4114 237.7646 241.9651 241.9667 246.7577 246.7622 248.4506 248.9572 253.9470 259.3118 260.2913 260.2915 269.5133 269.9363 274.2835 305.6583 313.7683 314.1166 355.0479 674.6759 789.0220 799.8360 800.2410 813.8799 1040.9886 2307.0793 4052.3363 5400.8584 12334.1363 electronvolt
energy: -2472.1667 -411.6636 -297.2986 -235.2421 -175.1496 -175.0144 -174.8038 -30.6010 -25.4639 -16.3264 -13.7973 -13.6018 -12.5754 -9.7673 -3.1183 2.3176 2.5150 3.1726 3.4873 4.3872 4.8352 4.9078 6.4695 6.6196 6.7143 8.6287 8.6537 9.0120 10.7318 10.9470 12.9248 13.1962 13.6012 14.7130 15.6541 15.6673 19.1629 21.0475 21.9734 22.1787 25.4390 26.1155 26.1283 26.7080 26.7184 27.1941 28.5008 28.5240 28.7171 28.8908 30.5891 30.5948 31.3218 31.3991 34.0586 35.3558 35.5261 35.9511 36.0151 36.1302 40.6306 41.9767 42.0564 43.9174 47.1471 48.5707 48.5723 50.5888 50.6872 52.2404 52.2411 56.7132 58.2668 58.3097 58.3149 58.3930 61.7630 62.9647 68.5452 68.6487 73.2520 73.2532 75.6817 75.6860 79.4563 79.5177 79.7260 80.7481 80.9090 83.3453 83.3578 84.5539 84.5600 84.6521 85.2741 85.2844 85.4820 85.4846 90.2122 90.2149 91.2938 93.0187 93.0306 95.9501 95.9867 97.1882 98.8360 98.8876 99.1892 103.3842 103.5034 104.5367 104.5460 106.5014 111.6496 113.5085 113.5465 119.7978 119.9650 129.2678 134.1196 134.1201 138.5573 138.5597 144.9588 144.9696 146.5728 151.8204 156.7623 156.9003 156.9573 156.9577 165.1868 165.1872 166.1574 166.1618 171.7582 171.7591 173.0883 173.2157 175.8008 192.5525 192.5555 199.0619 203.9782 203.9806 208.0151 211.7476 211.8702 215.9571 231.8295 233.1758 233.1827 237.5697 237.5724 237.7593 237.8482 242.2968 242.3079 247.2717 247.2783 248.7789 249.0040 254.0862 259.4775 261.0250 261.0357 270.0922 270.1117 274.5282 306.0257 314.1940 314.2307 355.1538 674.8494 788.8863 800.3219 800.4344 813.9674 1041.2565 2307.2330 4052.2851 5400.9330 12334.2071 electronvolt
chargesum: 0.0000000
charge: -0.170139 0.052314 0.117824
charge: 0.179127 -0.703984 0.524857
qa: -0.1701 0.0523 0.1178
va: 3.0807 4.2015 2.2515
total: -490.730468495 hartree
dispcorr: -0.001748818 hartree
energy: -490.732217313359
dipole: -0.03712 1.01037 0.97325 0.01346 -0.36668 -0.35321 0.00000 -0.00000 -0.00000
magnitude: 1.03536 au
magnitude: 2.63168 debye
