program: Orca
programVersion: 5.0.3
elementType: C C C C N C H H H H H
charge: 0
multiplicity: 1
keywords: SP DSD-BLYP D3BJ def2-QZVPP def2-QZVPP/C def2/J TightSCF keepdens
formula: C5H5N
InChI: InChI=1S/C5H5N/c1-2-4-6-5-3-1/h1-5H
11 atoms
C  -1.150719 0.759254 -0.045042
C  0.077902 1.399764 -0.028821
C  1.227915 0.628242 0.016454
C  1.093538 -0.752477 0.043384
N  -0.0765 -1.374349 0.028345
C  -1.170306 -0.627722 -0.014999
H  -2.075117 1.31933 -0.080127
H  0.138131 2.480069 -0.051103
H  2.208637 1.083573 0.030548
H  1.971497 -1.388176 0.079032
H  -2.113473 -1.162999 -0.026366
totalener: -247.57217756 hartree
nucrepener: 207.35309430 hartree
electener: -454.92527186 hartree
oneelecener: -743.89613126 hartree
twoeener: 288.97085939 hartree
kineticenergy: 246.90656832 hartree
exchangeener: -10.668196558785 hartree
correlationener: -0.761446953530 hartree
xcener: -11.429643512315 hartree
chargesum: 0.0000000
charge: -0.147121 0.027157 -0.143212 0.058424 -0.375886 0.061655 0.091507 0.089569 0.089914 0.124865 0.123128
charge: 0.053307 0.074047 0.053322 -0.104738 0.340382 -0.104851 -0.062021 -0.055315 -0.062070 -0.066027 -0.066035
qa: -0.1471 0.0272 -0.1432 0.0584 -0.3759 0.0617 0.0915 0.0896 0.0899 0.1249 0.1231
va: 3.8374 3.7521 3.8340 3.8557 3.0084 3.8558 0.9900 0.9937 0.9900 0.9768 0.9776
total: -248.087091491 hartree
dispcorr: -0.006627020 hartree
energy: -248.093718511757
dipole: 0.12124 -0.07143 0.04980 2.18006 -1.28604 0.89401 -0.04489 0.02649 -0.01841
magnitude: 0.89559 au
magnitude: 2.27641 debye
