program: Orca
programVersion: 5.0.3
elementType: O C C C C C C H H H H H
charge: -1
multiplicity: 1
keywords: SP DSD-BLYP D3BJ def2-QZVPP def2-QZVPP/C def2/J TightSCF keepdens
formula: C6H5O
InChI: InChI=1S/C6H5O/c7-6-4-2-1-3-5-6/h1-5H
12 atoms
O  2.154867 -0.757811 -0.013868
C  0.975032 -0.342508 -0.005744
C  0.623294 1.05705 -0.005632
C  -0.682294 1.50235 0.002542
C  -1.763136 0.61969 0.011139
C  -1.471499 -0.745154 0.01096
C  -0.174558 -1.214616 0.002871
H  1.438048 1.774987 -0.012281
H  -0.871708 2.573497 0.002249
H  -2.785044 0.979005 0.017545
H  -2.28943 -1.462257 0.017388
H  0.011855 -2.28439 0.002937
totalener: -306.04881751 hartree
nucrepener: 260.75182534 hartree
electener: -566.80064284 hartree
oneelecener: -941.01937721 hartree
twoeener: 374.21873437 hartree
kineticenergy: 305.28183021 hartree
exchangeener: -12.856394772593 hartree
correlationener: -0.913352787005 hartree
xcener: -13.769747559598 hartree
chargesum: -1.0000000
charge: -0.650668 0.072001 -0.119667 -0.100768 -0.214419 -0.106757 -0.115845 0.056577 0.041109 0.038982 0.043996 0.055461
charge: 0.106206 -0.598783 0.007741 -0.015808 -0.046130 -0.015841 0.007822 -0.091687 -0.079176 -0.103533 -0.079137 -0.091675
qa: -0.6507 0.0720 -0.1197 -0.1008 -0.2144 -0.1068 -0.1158 0.0566 0.0411 0.0390 0.0440 0.0555
va: 1.7474 4.3111 3.5197 3.7459 3.7428 3.7486 3.5186 1.0086 0.9927 1.0019 0.9918 1.0085
total: -306.678913058 hartree
dispcorr: -0.007752987 hartree
energy: -306.686666044568
dipole: -4.18634 2.55323 -1.63310 1.47187 -0.89794 0.57393 0.02591 -0.01541 0.01050
magnitude: 1.73105 au
magnitude: 4.39998 debye
