program: Orca
programVersion: 5.0.3
elementType: O C N C O C C C C C C C C C H H H H H H H H H H
charge: -1
multiplicity: 1
keywords: SP DSD-BLYP D3BJ def2-QZVPP def2-QZVPP/C def2/J TightSCF keepdens
formula: C11H10NO2
InChI: InChI=1S/C11H10NO2/c13-10-8-4-1-2-5-9(8)11-12(10)6-3-7-14-11/h1-2,4-5H,3,6-7H2
24 atoms
O  0.118063 0.849279 -2.585512
C  0.164311 0.462146 -1.467641
N  -1.015992 0.113466 -0.704995
C  -0.672726 -0.270707 0.509953
O  -1.490417 -0.642074 1.41162
C  -2.918524 -0.686394 1.097153
C  -3.279925 0.348495 0.055818
C  -2.392385 0.210025 -1.171414
C  0.767312 -0.216769 0.67598
C  1.5741 -0.519566 1.752629
C  2.946956 -0.36039 1.570611
C  3.467466 0.080475 0.360082
C  2.639249 0.384591 -0.723342
C  1.287519 0.226428 -0.53836
H  -3.127204 -1.704508 0.76551
H  -3.414183 -0.517369 2.049022
H  -3.199184 1.354259 0.473094
H  -4.323593 0.206361 -0.225161
H  -2.636009 -0.678683 -1.755369
H  -2.472145 1.074016 -1.828986
H  1.171829 -0.863465 2.695651
H  3.619563 -0.584878 2.386527
H  4.538003 0.190947 0.255093
H  3.045828 0.728862 -1.66452
totalener: -628.63464974 hartree
nucrepener: 873.46949288 hartree
electener: -1502.10414262 hartree
oneelecener: -2604.47322569 hartree
twoeener: 1102.36908307 hartree
kineticenergy: 627.63204405 hartree
exchangeener: -26.162304184076 hartree
correlationener: -1.859552736127 hartree
xcener: -28.021856920203 hartree
chargesum: -1.0000000
charge: -0.573272 0.207504 -0.405028 0.165041 -0.448667 0.199834 -0.103442 0.125676 0.091064 -0.197231 -0.143854 -0.223472 -0.135084 -0.014017 -0.010612 0.045995 0.046503 0.029924 0.017774 0.085967 0.067347 0.040433 0.040177 0.091442
charge: 0.203536 -0.662067 0.411704 -0.620610 0.532196 -0.019947 0.095619 0.040360 -0.172595 0.033619 -0.007691 -0.034195 0.053583 -0.164775 -0.071676 -0.066050 -0.046763 -0.058532 -0.063132 -0.047695 -0.078728 -0.089408 -0.103005 -0.063747
qa: -0.5733 0.2075 -0.4050 0.1650 -0.4487 0.1998 -0.1034 0.1257 0.0911 -0.1972 -0.1439 -0.2235 -0.1351 -0.0140 -0.0106 0.0460 0.0465 0.0299 0.0178 0.0860 0.0673 0.0404 0.0402 0.0914
va: 1.8599 4.2566 3.0802 3.5847 1.8788 3.7799 3.8654 3.7589 3.3775 3.7618 3.8224 3.7200 3.7715 3.2270 1.0185 0.9634 0.9893 0.9942 1.0082 1.0002 1.0013 0.9989 1.0072 0.9982
total: -629.919982327 hartree
dispcorr: -0.018518907 hartree
energy: -629.938501234759
dipole: -6.40281 3.53077 -2.87204 -0.74164 0.36137 -0.38027 2.93477 -1.81093 1.12384
magnitude: 3.10745 au
magnitude: 7.89850 debye
