program: Orca
programVersion: 5.0.3
elementType: C C C C O C O O H H H H H H H H
charge: -2
multiplicity: 1
keywords: SP DSD-BLYP D3BJ def2-QZVPP def2-QZVPP/C def2/J TightSCF keepdens
formula: C5H8O3
InChI: InChI=1S/C5H8O3/c1-4(6)3-5(7)8-2/h3H2,1-2H3
16 atoms
C  -2.909731 -0.747596 -0.019764
C  -1.485659 -0.434192 0.3571
C  -0.818219 0.648067 -0.477859
C  0.664491 0.72403 -0.217128
O  1.288017 -0.311022 -0.772468
C  2.681788 -0.426055 -0.521639
O  1.209252 1.590542 0.403989
O  -0.908173 -0.987154 1.252862
H  -3.382048 -1.373876 0.733076
H  -3.4950 0.162831 -0.15619
H  -2.92578 -1.27828 -0.974635
H  -1.020929 0.468642 -1.537285
H  -1.275288 1.608154 -0.226485
H  2.885716 -0.532103 0.543858
H  3.007314 -1.322209 -1.042769
H  3.232964 0.435165 -0.900017
totalener: -419.69218974 hartree
nucrepener: 379.22742240 hartree
electener: -798.91961214 hartree
oneelecener: -1341.81536451 hartree
twoeener: 542.89575237 hartree
kineticenergy: 419.30780669 hartree
exchangeener: -16.713848408627 hartree
correlationener: -1.169930419905 hartree
xcener: -17.883778828532 hartree
chargesum: -2.0000000
charge: 1.349220 -0.497069 0.461145 0.408876 -0.517831 0.978693 -0.501756 -0.333495 -0.092220 -0.670348 -0.667694 -0.526127 -0.396020 -0.418584 -0.136296 -0.440494
charge: 0.189483 -0.508680 0.087892 -0.800114 0.517451 0.017852 0.285047 0.311484 -0.202640 -0.326531 -0.352506 -0.265269 -0.206286 -0.240254 -0.245770 -0.261159
qa: 1.3492 -0.4971 0.4611 0.4089 -0.5178 0.9787 -0.5018 -0.3335 -0.0922 -0.6703 -0.6677 -0.5261 -0.3960 -0.4186 -0.1363 -0.4405
va: -3.0199 4.3875 1.9252 4.0570 2.2079 0.0736 2.0243 1.7406 1.0399 1.5904 1.5673 1.6761 1.5553 1.4521 1.2401 1.5430
total: -420.528663079 hartree
dispcorr: -0.007475279 hartree
energy: -420.536138357728
dipole: -2.76566 4.55607 1.79042 -1.71409 2.35131 0.63722 -3.32719 4.59362 1.26642
magnitude: 2.28374 au
magnitude: 5.80480 debye
