program: Orca
programVersion: 5.0.3
elementType: C C C C O C O O H H H H H H H H
charge: -1
multiplicity: 2
keywords: SP DSD-BLYP D3BJ def2-QZVPP def2-QZVPP/C def2/J TightSCF keepdens
formula: C5H8O3
InChI: InChI=1S/C5H8O3/c1-4(6)3-5(7)8-2/h3H2,1-2H3
16 atoms
C  -2.909731 -0.747596 -0.019764
C  -1.485659 -0.434192 0.3571
C  -0.818219 0.648067 -0.477859
C  0.664491 0.72403 -0.217128
O  1.288017 -0.311022 -0.772468
C  2.681788 -0.426055 -0.521639
O  1.209252 1.590542 0.403989
O  -0.908173 -0.987154 1.252862
H  -3.382048 -1.373876 0.733076
H  -3.4950 0.162831 -0.15619
H  -2.92578 -1.27828 -0.974635
H  -1.020929 0.468642 -1.537285
H  -1.275288 1.608154 -0.226485
H  2.885716 -0.532103 0.543858
H  3.007314 -1.322209 -1.042769
H  3.232964 0.435165 -0.900017
totalener: -419.91034283 hartree
nucrepener: 379.22742240 hartree
electener: -799.13776523 hartree
oneelecener: -1336.98030214 hartree
twoeener: 537.84253690 hartree
kineticenergy: 419.36454448 hartree
exchangeener: -16.735350632199 hartree
correlationener: -1.163582979928 hartree
xcener: -17.898933612127 hartree
s2: 0.761598
chargesum: -1.0000000
charge: -0.264909 0.007565 -0.039980 0.450703 -0.386063 0.005262 -0.498195 -0.648642 0.083601 0.029929 0.010388 -0.004356 0.012559 0.107651 0.064532 0.069954
charge: 0.134187 -0.717794 0.025022 -0.770903 0.526476 0.052292 0.285921 0.140566 -0.078724 -0.099002 -0.112054 -0.077175 -0.082328 -0.066743 -0.081807 -0.077936
qa: -0.2649 0.0076 -0.0400 0.4507 -0.3861 0.0053 -0.4982 -0.6486 0.0836 0.0299 0.0104 -0.0044 0.0126 0.1077 0.0645 0.0700
va: 3.7709 4.0421 3.5841 4.0550 1.9943 3.8417 1.9917 1.7607 1.0136 0.9969 1.0354 0.9907 1.0033 1.0031 0.9827 0.9886
total: -420.718177221 hartree
dispcorr: -0.007475279 hartree
energy: -420.725652500123
dipole: -2.76566 4.49337 1.72771 -1.71409 2.03643 0.32234 -3.32719 1.83020 -1.49700
magnitude: 2.30865 au
magnitude: 5.86813 debye
